Deployment error when I deploy my application world Hello to device of BB curve 8900

I am facing deployment error while I deply to device Iam using the version of the sdk webworks: BlackBerry WebWorks SDK 2.3.1.5

IAM using the webworks said above, windows 8 64-bit system, when I deploy it in the Simulator for other versions I see global demand for Hello in the emulator to ripple, but when I try to look for 8900 device that is not listed in the webworks platform why is it so?

My camera works with OS 4.6.1, then how to deploy my application world Hello to this device of curve 8900?
If the JDE or jre must be downgraded on 4.6.1 how? I need to change my environment variable

Someone in a pile on flow said like that. "

You as a developer WebWorks don't treat BrowserField instance, but your app to launch and work, needs this new implementation of the BrowserField class that supports the required functionality.

Software more former device does not support the feature that provides new BrowserField. And as a result, it is not possible to launch WebWorks applications on older devices OS-es to 5.0.
"So do I need higher version OS to run my application helloworld on my device.

SDK BlackBerry WebWorks 2.3.1.5 has a requirement of BlackBerry OS 5.0 because of the new BrowserField object (which has been introduced in BBOS 5.0 that you noted.) You will not be able to deploy a WebWorks to any device that runs a pre - 5.0 operating system.

Tags: BlackBerry Developers

Similar Questions

  • Creative Cloud Desktop said that there is a download error when I open the applications tab. I tried the button Reload Applications with no luck. Any ideas?

    Creative Cloud Desktop said that there is a download error when I open the applications tab. I tried the button Reload Applications with no luck. Any ideas?

    John has provided all of the above resolution, could follow please this new https://helpx.adobe.com/creative-cloud/kb/Download-error-apps-tab.html

    In the case where you do not succeed please contact support.

    Concerning

    Stéphane

  • Error when installing the sample application Showcase in APEX 5.0.2 @ XE geolocation

    Hello

    I'm new to APEX and want to learn something related to the geolocation thing, APEX 5.0.2 running on XE, when I tried to install the sample application geolocation showcase, I got the following error:

    Error on line 22: PLS-00201: identifier ' ORDIMAGE. PROCESSCOPY' must be declared

    After some research, I found that the package eba_spatial_sample was not created correctly, and it gave me error when I try to compile the package:

    Compilation failed, line 22 (01: 37:34)

    PLS-00201: identifier ' ORDIMAGE. PROCESSCOPY' should be omitted declaredCompilation, line 22 (01: 37:34)

    PL/SQL: statement ignoredCompilation failed, line 65 (01: 37:34)

    PLS-00201: identifier ' ORDIMAGE. GETMETADATA' should be omitted declaredCompilation, line 65 (01: 37:34)

    PL/SQL: Statement ignored


    Seems to be something related to the ORDIMAGE object, everyone has an idea about that?


    Thank you much in advance.

    Dong

    Jerry Dong wrote:

    I'm new to APEX and want to learn something related to the geolocation thing, APEX 5.0.2 running on XE, when I tried to install the sample application geolocation showcase, I got the following error:

    Error on line 22: PLS-00201: identifier ' ORDIMAGE. PROCESSCOPY' must be declared

    After some research, I found that the package eba_spatial_sample was not created correctly, and it gave me error when I try to compile the package:

    Compilation failure, line 22 (01: 37:34)

    PLS-00201: identifier ' ORDIMAGE. PROCESSCOPY' must be declaredCompilation failed, line 22 (01: 37:34)

    PL/SQL: Statement ignoredCompilation failed, 65 line (01: 37:34)

    PLS-00201: identifier ' ORDIMAGE. GETMETADATA' must be declaredCompilation failed, line 65 (01: 37:34)

    PL/SQL: Statement ignored

    Seems to be something related to the ORDIMAGE object, everyone has an idea about that?

    ORDImage is an Oracle's Multimedia component. Oracle multimedia is not included in 11 g Express Edition...

    Upgrade to the Standard or Enterprise edition if you need multimedia features or features depend on.

    The Oracle index , however, is available in all editions of the database. See the database Express Edition 2 day more Locator Developer Guide for a tutorial and examples.

  • error when installing a packaged application

    Hello

    I get the following error when trying to install the application "Sample Master Detail" in my account to oracle apex on the web. All other install without problem. What could be?

    Thank you
    Juan


    Execution of the statement was not successful. ORA-00001: unique constraint (APEX_040200.WWV_FLOW_MESSAGES_IDX1) violated

    declare
    h varchar2 (32767): = null;

    Start

    h : = h || "Help";

    () wwv_flow_api.create_message
    P_ID = > 2456294651379654494 + wwv_flow_api.g_id_offset,
    p_flow_id = > wwv_flow.g_flow_id,
    p_name = > 'HELP. "
    p_message_language = > 'fr ',.
    p_message_text = > h);
    null;

    end;

    ORA-00001: unique constraint (APEX_040200.WWV_FLOW_MESSAGES_IDX1) violated

    Hi Jozef,

    Just to let you know, the issue of the installation of packaged application on apex.oracle.com example dialog box has now been resolved.

    My apologies for any inconvenience that the issue may have caused.

    Kind regards
    Hilary

  • Error when trying to run application on blackberry

    Hello

    I am creating an application. I've been adding new bits to the app every day, and then test it work on the blackberry bold 9700 himself. It works very well since I started. However today, trying to open the application on the blackberry, I get the error:

    Error starting UiFun: Module 'UiFun' trying to access a secure API

    I did some research on this and installed the signatures of code to Eclipse. But I still get this message, even if the application works well in the Simulator.

    Have you signed the application after conditioning?

    Signature is required when an application is deployed on a device. In the Simulator, a warning may appear in the IDE, but the application will run without a signature.

    And make sure you do not automatically rebuild after the signature, or you may end up needing to sign again.

    You can always know because the signature tool is not sign modules that are already signed.

  • Error when running in jdeveloper application

    Dear all,

    When I try to run the application in jdeveloper it gives me error follwing newspaper.
    Any body can help me on this...

    < 25 January 2011 18:39:52 IST > < error > < JDBC > < BEA-001553 > < could not deploy JDBC data source conMessages. No credential Mapper entry found for messages the indirection user password >
    < 25 January 2011 18:39:52 IST > < error > < hats > < BEA-149205 > < could not initialize the application "fileupload" due to the error weblogic.application.ModuleException:.
    weblogic.application.ModuleException:
    at weblogic.jdbc.module.JDBCModule.prepare(JDBCModule.java:290)
    at weblogic.application.internal.flow.ModuleListenerInvoker.prepare(ModuleListenerInvoker.java:199)
    to weblogic.application.internal.flow.DeploymentCallbackFlow$ 1.next(DeploymentCallbackFlow.java:507)
    at weblogic.application.utils.StateMachineDriver.nextState(StateMachineDriver.java:41)
    at weblogic.application.internal.flow.DeploymentCallbackFlow.prepare(DeploymentCallbackFlow.java:149)
    Truncated. check the log file full stacktrace

    Caused by: weblogic.common.ResourceException: java.security.PrivilegedActionException: weblogic.common.ResourceException: java.security.PrivilegedActionException: weblogic.common.ResourceException: no entry credential Mapper found for user password indirection = messages for data source conMessages
    at weblogic.jdbc.common.internal.DataSourceConnectionPoolConfig.getPoolProperties(DataSourceConnectionPoolConfig.java:85)
    at weblogic.jdbc.common.internal.ConnectionPool.doStart(ConnectionPool.java:1109)
    at weblogic.jdbc.common.internal.ConnectionPool.start(ConnectionPool.java:147)
    at weblogic.jdbc.common.internal.ConnectionPoolManager.createAndStartPool(ConnectionPoolManager.java:385)
    at weblogic.jdbc.common.internal.ConnectionPoolManager.createAndStartPool(ConnectionPoolManager.java:326)
    Truncated. check the log file full stacktrace


    -Thank you

    I think the default location is C:\Users\\AppData\Roaming\JDeveloper\system11.1.1.3.37.56.60\

    You can try to remove the DefaultDomain directory from there to start (instead of destroying the entire system directory)

  • Fatal error when installing the Server Application Weblogic 11 g (10.3.4)

    Hello

    In the first attempt, I installed a Weblogic 10.3.4 server but when I was deploying an ear, server gets crashed (JDK was crushed) and after that, I was unable to start the server because it gave an error JDK.

    So I uninstalled existing Weblogic server and tried to install the server (same version using the same configuration) once more, but it does not. It asks me for the directory (WLS Home Directory), Complete/Custom and finally the installation, it is down a mistake (when 39% installation is complete) 'fatal error occurred during installation of the file and install it will cleanup now, out! " \Wlserver_10.3\common\bin\consol.exe C:\ < host directory > (access denied)".

    Can someone help me please to solve this error. Thanks in advance

    Kind regards

    Priya

    Hello

    The message that took place there is a permission problem. So could you please try the installation with administrator privileges.

    In case if the same mistakes persist could you try to install another directory C in a different way.

    Kind regards.

    Prakash.

  • Error when approval of the application...

    Hello

    I created a composite SOA in the approver 1st level is Manager and second level approval is a role. When I put the request the task is entrusted to the Manager and manager approves it. The task is assigned to the role. However the question is, when a member of the role trying to approve the task, the following error is thrown. Please note that it is able to reject the application if, only if approved, I see the error below.

    Although it shows the newspaper as warning, but on the approval of the user interface, it generates an error. That is to say. "" An error occurred ".

    Clues Pls!

    # < 7 August 2012 15:42:56 IS > < opinion > < Stdout > < bubo.stadi.sonera.fi > < soa_server1 > < ExecuteThread [ASSET]: '3' for queue: '(self-adjusting) weblogic.kernel.Default' > < < WLS Kernel > > <>< a94ee5b878875ef9:-47c429e2:138eb2557d6: - 8000-000000000007 520 d > < 1344343376602 > < BEA-000000 > < < 7 August 2012 15:42:56 IS >

    < WARNING > < oracle.soa.services.workflow.persistency > < BEA-000000 > < < PredicateImpl.getPredicateCondtion > request values for columns that can contain several types of identity (users, groups, approles) should be IdentityType or an IdentityType object list. Incorrect use of "WF_NONEXISTENT_ASSIGNEE" for the "wfa.assignee" column > >

    # < 7 August 2012 15:42:56 IS > < opinion > < Stdout > < bubo.stadi.sonera.fi > < soa_server1 > < ExecuteThread [ASSET]: '3' for queue: '(self-adjusting) weblogic.kernel.Default' > < < WLS Kernel > > <>< a94ee5b878875ef9:-47c429e2:138eb2557d6:-8000-000000000007d51f > < 1344343376602 > < BEA-000000 > < < 7 August 2012 15:42:56 IS >

    < WARNING > < oracle.soa.services.workflow.persistency > < BEA-000000 > < < QueryUtil.warnForUseOfNonIdentityTypeValues > request values for columns that can contain several types of identity (users, groups, approles) should be IdentityType or an IdentityType object list. Incorrect use of "WF_NONEXISTENT_ASSIGNEE" for the "wfa.assignee" column > >

    You have the right to request approver. Add the approver to the administrator application role.

    Thank you
    Suren

  • I get an error when I try to install World of Warcraft.

    From: KPizzle

     
    Hi, whenever I try to install WoW on my laptop Dell Inspiron 1520, I get the following error at about 98% of the way through the installation.

    "The file"C:\Program World of Warcraft.temp\Data.temp\enUS.temp\Documentation.temp"could not be renamed to"C:\Program World of Warcraft.temp\Data.temp\enUS.temp\Documentation".

    (ConflictManager::ResolveConflicts/1) »

    I am running Windows Vista and I have a 8600GT with 2 GB of ram.  I have no idea why this happens, can someone find a solution for me please?

    Thank you!

    From: Mark

    There are a lot of people on this list who are playing WOW under Vista so it must work.

    A couple of easy things to try:

    1 - remove the folder C:\Program World of Warcraft.temp. Its possible that it I messed up during the installation of the system and the file is locked, preventing new attempts to working installation.

    2 - right click on the file setup.exe on your cd and select 'Run as administrator', it might be useful if it's a permissions problem

    Hope thelps!

    Mark

    Another response of the community of Windows Vista discussion groups

  • Eception exception: java.lang.Error when starting a selfwritten application

    Hello

    I have a self written request. When I run the app on the Simulator, it throws the error above. The error takes place before any breakpoint is reached. If debugging is really hard. I put a breakpoint on ' > ', but it is never reached.

    public static void main(String[] args) {
    
        Program program;
        try {
    >>>>        program = Program.instance();
            program.run(args);
        } catch (Throwable e) {
            final String msg = _resources.getString(ERROR_COULD_NOT_START_APPLICATION) + ": " + e.getMessage();
            UiApplication.getUiApplication().invokeLater(new Runnable() {
                public void run() {
                    Dialog.alert(msg);
                }
            });
            return;
        }
        ...
    }
    

    Any help is appreciated.

    The problem is very simple. I used a clean class of parameters that can be Persistable. I give to uncomment the ' implements Persistable ".

  • 6.3 - Windows 10 bridge - error when trying to open application could not start properly 0x00007b

    Machine: Dell XPS 8700

    OS: Windows 10

    After you install Adobe Bridge 6.3, I can't launch the application as a standalone - get error message request "the application could not start properly (0x00007b). Click Ok to close the application. »

    If I run the application Photoshop CC I can launch Adobe Bridge the click file-> Browse in Bridge, then Bridge opens without error.

    System information:

    Adobe Photoshop Version: 2015.5.1 20160722.r.156 2016/07 / 22:23:00:00 CL 1083377 x 64

    Operating system: Windows 64-bit 10

    Version: 10 or higher

    System architecture: Intel CPU Family: 6, model: 12 Stepping: 3 with MMX, SSE whole, FP SSE, SSE2, SSE3, SSE4.1, SSE4.2, AVX, AVX2, HyperThreading

    Physical processor count: 4

    Number of logical processors: 8

    Processor speed: 3392 MHz

    Built-in memory: 12238 MB

    Free memory: 8003 MB

    Memory available to Photoshop: 10726 MB

    Memory used by Photoshop: 59%

    Layers of alias: ^ 0

    Range of modifier: enabled.

    Space design: disabled.

    Multi-frequency 3D printing: disabled.

    HighBeam: enabled.

    Tile image size: 1024K

    Image cache level: 4

    Overview of fonts: medium

    TextComposer: Latin

    Display: 1

    Limits of the display: top = 0, left = 0, low = 1200, right = 1920

    Display: 2

    Limits of the display: top = 0, left = 1920, low = 1080, right = 3840

    OpenGL drawing: enabled.

    OpenGL allows old GPU: not detected.

    OpenGL drawing mode: basic

    OpenGL allows Normal Mode: true.

    OpenGL allows Advanced Mode: true.

    AIFCoreInitialized = 1

    AIFOGLInitialized = 1

    OGLContextCreated = 1

    NumGLGPUs = 1

    NumCLGPUs = 2

    glgpu [0]. GLVersion = "4.1".

    glgpu [0]. IsIntegratedGLGPU = 0

    glgpu [0]. GLMemoryMB = 1024

    glgpu [0]. GLName = "NVIDIA GeForce GTX 645.

    glgpu [0]. GLVendor = "NVIDIA Corporation".

    glgpu [0]. GLVendorID = 4318

    glgpu [0]. GLDriverVersion = "10.18.13.5382".

    glgpu [0]. GLRectTextureSize = 16384

    glgpu [0]. GLRenderer = 'GeForce GTX PCIe/645/SSE2.

    glgpu [0]. GLRendererID = 4548

    glgpu [0]. HasGLNPOTSupport = 1

    glgpu [0]. GLDriver = "nvd3dumx.dll, nvwgf2umx.dll, nvwgf2umx.dll, nvwgf2umx.dll, nvd3dum, nvwgf2um, nvwgf2um, nvwgf2um"

    glgpu [0]. GLDriverDate = "20150807000000.000000 - 000.

    glgpu [0]. CanCompileProgramGLSL = 1

    glgpu [0]. GLFrameBufferOK = 1

    glgpu [0] .glGetString [GL_SHADING_LANGUAGE_VERSION] = '4.50 NVIDIA.

    glgpu [0] .glGetProgramivARB [GL_FRAGMENT_PROGRAM_ARB] [GL_MAX_PROGRAM_INSTRUCTIONS_ARB] = [1638-4]

    glgpu [0] .glGetIntegerv [GL_MAX_TEXTURE_UNITS] = [4]

    glgpu [0] .glGetIntegerv [GL_MAX_COMBINED_TEXTURE_IMAGE_UNITS] = [192]

    glgpu [0] .glGetIntegerv [GL_MAX_VERTEX_TEXTURE_IMAGE_UNITS] = [32]

    glgpu [0] .glGetIntegerv [GL_MAX_TEXTURE_IMAGE_UNITS] = [32]

    glgpu [0] .glGetIntegerv [GL_MAX_DRAW_BUFFERS] = [8]

    glgpu [0] .glGetIntegerv [GL_MAX_VERTEX_UNIFORM_COMPONENTS] = [4096]

    glgpu [0] .glGetIntegerv [GL_MAX_FRAGMENT_UNIFORM_COMPONENTS] = [2048]

    glgpu [0] .glGetIntegerv [GL_MAX_VARYING_FLOATS] = [124]

    glgpu [0] .glGetIntegerv [GL_MAX_VERTEX_ATTRIBS] = [16]

    glgpu [0] .extension [AIF::OGL:GL_ARB_VERTEX_PROGRAM] = 1

    glgpu [0] .extension [AIF::OGL:GL_ARB_FRAGMENT_PROGRAM] = 1

    glgpu [0] .extension [AIF::OGL:GL_ARB_VERTEX_SHADER] = 1

    glgpu [0] .extension [AIF::OGL:GL_ARB_FRAGMENT_SHADER] = 1

    glgpu [0] .extension [AIF::OGL:GL_EXT_FRAMEBUFFER_OBJECT] = 1

    glgpu [0] .extension [AIF::OGL:GL_ARB_TEXTURE_RECTANGLE] = 1

    glgpu [0] .extension [AIF::OGL:GL_ARB_TEXTURE_FLOAT] = 1

    glgpu [0] .extension [AIF::OGL:GL_ARB_OCCLUSION_QUERY] = 1

    glgpu [0] .extension [AIF::OGL:GL_ARB_VERTEX_BUFFER_OBJECT] = 1

    glgpu [0] .extension [AIF::OGL:GL_ARB_SHADER_TEXTURE_LOD] = 1

    clgpu [0]. CLPlatformVersion = "1.2".

    clgpu [0]. CLDeviceVersion = 'CUDA 1.2.

    clgpu [0]. IsIntegratedCLGPU = 0

    clgpu [0]. CLMemoryMB = 1024

    clgpu [0]. CLName = 'GeForce GTX 645.

    clgpu [0]. CLVendor = "NVIDIA Corporation".

    clgpu [0]. CLVendorID = 4318

    clgpu [0]. CLDriverVersion = "353.82.

    clgpu [0]. CUDASupported = 1

    clgpu [0]. CUDAVersion = "7.5.15.

    clgpu [0]. CLBandwidth = 5.09008e + 10

    clgpu [0]. CLCompute = 248.092

    clgpu [1]. CLPlatformVersion = "1.2".

    clgpu [1]. CLDeviceVersion = 'CUDA 1.2.

    clgpu [1]. IsIntegratedCLGPU = 0

    clgpu [1]. CLMemoryMB = 1024

    clgpu [1]. CLName = 'GeForce GTX 645.

    clgpu [1]. CLVendor = "NVIDIA Corporation".

    clgpu [1]. CLVendorID = 4318

    clgpu [1]. CLDriverVersion = "353.82.

    clgpu [1]. CUDASupported = 1

    clgpu [1]. CUDAVersion = "7.5.15.

    clgpu [1]. CLBandwidth = 5.0921e + 10

    clgpu [1]. CLCompute = 248.091

    Type of license: subscription

    Serial number: 96040700193502189379

    GUIDBucket:

    bucket: 84

    test: Butler

    The application folder: C:\Program Files\Adobe\Adobe Photoshop CC 2015.5\

    Temporary file path: C:\Users\Debra\AppData\Local\Temp\

    Zero Photoshop has async I/O active

    Scratch the volumes:

    C:\, 917.5 G, 752,9 free G

    Required plugins folder: C:\Program Files\Adobe\Adobe Photoshop CC 2015.5\Required\Plug-Ins\

    Main Plug-ins folder: C:\Program Files\Adobe\Adobe Photoshop CC 2015.5\Plug-ins\

    Installed components:

    A3DLIBS.dll A3DLIB 9.2.0.112 dynamic link library

    ACE.dll ACE 2016/05/07-01: 09: 29 79,573668 79.573668

    PatchMatch 2016/05/17:03:10:18 1.573920 AdbePM.dll 1.573920

    AdobeLinguistic.dll Adobe linguistic Library 10.0.0

    AdobeOwl.dll Adobe Owl 5.2.11

    AdobePDFL.dll PDFL 2016/04/13-01: 12: 44 79,182661 79.182661

    Adobe AdobePIP.dll 7.3.1.128.44549 product improvement program

    AdobeSVGAGM.dll AdobeSVGAGM 79.571757 79.571757

    AdobeXMP.dll Adobe XMP Core 2016/04/19-13: 13:40 79,159284 79.159284

    AdobeXMPFiles.dll Adobe XMP files 2016/04/19-13: 13:40 79,159284 79.159284

    AdobeXMPScript.dll Adobe XMP Script 2016/04/19-13: 13: 40 79,159284 79.159284

    adobe_caps.dll Adobe CAPS 10,0,0,5

    AGM.dll AGM 2016/05/07-01: 09: 29 79,573668 79.573668

    ahclient.dll AdobeHelp Dynamic Link Library 2.0.0.2

    AIDE.dll HELP-2016/02/29-16:28:21 79,571906 79.571906

    Amtlib.dll AMTLib (64 Bit) 10.0.0.3BuildVersion: 10.0; Brand: Thursday, April 21, 2016 3:6:38) 1.000000

    ARE.dll ARE 2016/05/07-01: 09:29 79,573668 79.573668

    Axe8sharedexpat.dll AXE8SharedExpat 2015/03/13-23: 40:54 79,562390 79.562390

    AXEDOMCore.dll AXEDOMCore 2015/03/13-23: 40:54 79,562390 79.562390

    Bib.dll BIB 2016/05/07-01: 09: 29 79,573668 79.573668

    BIBUtils.dll BIBUtils 2016/05/07-01: 09: 29 79,573668 79.573668

    boost_date_time.dll photoshopdva 10.0.0

    boost_signals.dll photoshopdva 10.0.0

    boost_system.dll photoshopdva 10.0.0

    boost_threads.dll photoshopdva 10.0.0

    CG.dll NVIDIA Cg Runtime 3.0.00007

    cgGL.dll NVIDIA Cg Runtime 3.0.00007

    Adobe CIT.dll CIT 2.1.0.1 2.1.0.1

    CITThreading.dll Adobe CITThreading 2.1.0.1 2.1.0.1

    CoolType.dll CoolType 2016/05/07-01: 09: 29 79,573668 79.573668

    c:\windows\system32\dnssd.dll Hello 3,0,0,2

    dvaaudiodevice.dll photoshopdva 10.0.0

    dvacore.dll photoshopdva 10.0.0

    dvamarshal.dll photoshopdva 10.0.0

    dvamediatypes.dll photoshopdva 10.0.0

    dvametadata.dll photoshopdva 10.0.0

    dvametadataapi.dll photoshopdva 10.0.0

    dvametadataui.dll photoshopdva 10.0.0

    dvaplayer.dll photoshopdva 10.0.0

    dvatransport.dll photoshopdva 10.0.0

    dvaui.dll photoshopdva 10.0.0

    dvaunittesting.dll photoshopdva 10.0.0

    Dynamiclink.dll photoshopdva 10.0.0

    ExtendScript.dll ExtendScript 2016/01/26-16: 09: 33 80.1060872 80.1060872

    icucnv40.dll International Components for Unicode 2014 10/31-16: 52:45 Build gtlib_6.0.21339

    icudt40.dll International Components for Unicode 2014 10/31-16: 52:45 Build gtlib_6.0.21339

    icuuc40.dll International Components for Unicode 2014 10/31-16: 52:45 Build gtlib_6.0.21339

    igestep30.dll IGES 9.3.0.113 drive

    imslib.dll IMSLib DLL 10.0.0.1

    JP2KLib.dll JP2KLib 2016/02/19-14: 20: 46 79,261706 79.261706

    libifcoremd.dll Intel Visual Fortran compiler 10.0 (A patch)

    libiomp5md.dll Intel(r) OpenMP * Runtime Library 5.0

    libmmd.dll Intel(r) C Compiler, Intel C++ Compiler, Intel Fortran compiler 12.0

    LogSession.dll LogSession 7.3.1.128.44549

    mediacoreif.dll photoshopdva 10.0.0

    MPS.dll MPS 2016/02/24-01: 09: 44 79,571748 79.571748

    Microsoft® Visual Studio® msvcp120.dll 2013 12.00.21005.1

    Microsoft® Visual Studio® msvcr120.dll 2013 12.00.21005.1

    ONCore10.dll ONCore 10.0.0

    ONCoreFoundation10.dll ONCoreFoundation 10.0.0

    ONDocument10.dll ONDocument 10.0.0

    ONProxySupport10.dll ONProxySupport 10.0.0

    pdfsettings.dll Adobe PDFSettings 1.04

    Adobe Photoshop 2015.5 CC 17.0.1 Photoshop.dll

    Adobe Photoshop 2015.5 CC 17.0.1 plugin.dll

    PlugPlugExternalObject.dll CEP PlugPlugExternalObject Dll (64-bit) 7.0.0 Standard Adobe

    PlugPlugOwl.dll Adobe CSXS PlugPlugOwl Dll Standard (64 bit) 7.0.0.50

    PSArt.dll Adobe Photoshop 2015.5 CC 17.0.1

    PSViews.dll Adobe Photoshop 2015.5 CC 17.0.1

    SCCore.dll ScCore 2016/01/26-16: 09: 33 80.1060872 80.1060872

    SVGRE.dll SVGRE 79.571757 79.571757

    svml_dispmd.dll Intel (r) C Compiler, Intel C++ Compiler, Intel Fortran compiler 12.0

    TBB.dll Intel Threading Building Blocks for Windows 4, 4, 2016, 0120

    tbbmalloc.dll Intel Threading Building Blocks for Windows 4, 4, 2016, 0120

    TfFontMgr.dll FontMgr 9.3.0.113

    TfKernel.dll kernel 9.3.0.113

    Geom TFKGEOM.dll kernel 9.3.0.113

    Adobe TFUGEOM.dll, UGeom © 9.3.0.113

    updaternotifications.dll library Adobe Updater Notifications 10.0.0.1 (BuildVersion: 1.0;) Brand: BUILDDATETIME) 10.0.0.1

    VulcanControl.dll Vulcan Control Library 5.3.0.14 Application

    VulcanMessage5.dll Vulcan Message Library 5.3.0.13

    WRServices.dll WRServices Thursday 7 January 2016 04:50:10 build 0.21960 0,21960

    U3D writer 9.3.0.113 wu3d.dll

    Required plugins:

    3D Studio 17.0.1 (2015.5.1 x 001 003 x)-from the file "U3D.

    Accented edges 17.0.1 - from the file 'filters Gallery.

    Adaptive Wide Angle 17.0.1 - from the file "Adaptive Grand Angle"

    Angular Strokes 17.0.1 - from the file 'filters Gallery.

    Average 17.0.1 (2015.5.1 x 001 003 x)-from the file 'average '.

    Bas-relief 17.0.1 - from the file 'filters Gallery.

    BMP 17.0.1 - from the file "series MultiPlugin"

    Camera Raw 9.6.1 - from the file 'Camera Raw'

    Camera Raw Filter 9.6.1 - from the file 'Camera Raw'

    Chalk & & charcoal 17.0.1 - from the file 'filters Gallery.

    Charcoal 17.0.1 - from the file 'filters Gallery.

    Chrome 17.0.1 - from the file 'filters Gallery.

    17.0.1 Cineon (2015.5.1 x 001 003 x)-from the file "Cineon.

    17.0.1 clouds (2015.5.1 x 001 003 x)-from the file 'cloud '.

    COLLADA 17.0.1 (2015.5.1 x 001 003 x)-from the file "U3D.

    Color halftone 17.0.1 - from the file "series MultiPlugin"

    Color pencil 17.0.1 - from the file 'filters Gallery.

    CompuServe GIF 17.0.1 - from the file "series MultiPlugin"

    Conte pencil 17.0.1 - from the file 'filters Gallery.

    Craquelure 17.0.1 - from the file 'filters Gallery.

    Crop and straighten Photos 17.0.1 (2015.5.1 x 001 003 x)-from the file 'CropPhotosAuto '.

    Crop and straighten Photos filter 17.0.1 - from the file "series MultiPlugin".

    Crosshatch 17.0.1 - from the file 'filters Gallery.

    Crystallize 17.0.1 - from the 'MultiPlugin series' file

    Cutting 17.0.1 - from the file 'filters Gallery.

    Features dark 17.0.1 - from the file 'filters Gallery.

    Deinterlacing 17.0.1 - from the file "series MultiPlugin"

    DICOM 17.0.1 - from the file "Dicom".

    Difference clouds 17.0.1 (2015.5.1 x 001 003 x)-from the file 'cloud '.

    Diffuse Glow 17.0.1 - from the file 'filters Gallery.

    Move 17.0.1 - from the 'MultiPlugin series' file

    Dry brush 17.0.1 - from the file 'filters Gallery.

    Eazel Acquire 17.0.1 (2015.5.1 x 001 003 x)-from the file 'EazelAcquire '.

    17.0.1 entropy (2015.5.1 x 001 003 x)-from the 'statistics' file

    Export Tables to color search NO VERSION - from the file 'Export3DLUT '.

    Extrude 17.0.1 - from the 'MultiPlugin series' file

    Routine 17.0.1 FastCore (2015.5.1 x 001 003 x)-from the file "FastCore.

    Fiber 17.0.1 - from the 'MultiPlugin series' file

    Film Grain 17.0.1 - from the file 'filters Gallery.

    Filter the 17.0.1 - from the file «Filters Gallery» gallery

    Flash 3D 17.0.1 (2015.5.1 x 001 003 x)-from the file "U3D.

    Fresco 17.0.1 - from the file 'filters Gallery.

    Glass 17.0.1 - from the file 'filters Gallery.

    Scarlet contours 17.0.1 - from the file 'filters Gallery.

    Google Earth 4 17.0.1 (2015.5.1 x 001 003 x)-from the file "U3D.

    Grain 17.0.1 - from the file 'filters Gallery.

    Graphic pen 17.0.1 - from the file 'filters Gallery.

    Halftone Pattern 17.0.1 - from the file 'filters Gallery.

    HDRMergeUI 17.0.1 - from the file 'HDRMergeUI '.

    HSB/HSL 17.0.1 - from the file "series MultiPlugin"

    IFF Format 17.0.1 - from the file "series MultiPlugin"

    IGES 17.0.1 (2015.5.1 x 001 003 x)-from the file "U3D.

    Ink outlines 17.0.1 - from the file 'filters Gallery.

    JPEG 2000 17.0.1 - from the file "JPEG2000.

    Flattening coefficient 17.0.1 (2015.5.1 x 001 003 x)-from the 'statistics' file

    Lens Blur 17.0.1 - from the file "blur of the lens.

    17.0.1 Correction lens - from the file "Correction of the lens.

    Lens Flare 17.0.1 - from the file "series MultiPlugin"

    Fluidity 17.0.1 - from the file "fluidity".

    Matlab 17.0.1 operation (2015.5.1 x 001 003 x)-from the file "ChannelPort.

    maximum 17.0.1 (2015.5.1 x 001 003 x)-from the 'statistics' file

    Mean 17.0.1 (2015.5.1 x 001 003 x)-from the 'statistics' file

    Measure Core 17.0.1 (2015.5.1 x 001 003 x)-from the file 'MeasurementCore.8me '.

    Median 17.0.1 (2015.5.1 x 001 003 x)-from the 'statistics' file

    Mezzotint 17.0.1 - from the file "series MultiPlugin"

    Minimum 17.0.1 (2015.5.1 x 001 003 x)-from the 'statistics' file

    MMXCore routine 17.0.1 (2015.5.1 x 001 003 x)-from the file "MMXCore.

    Mosaic tiles 17.0.1 - from the file 'filters Gallery.

    Multiprocessor support 17.0.1 (2015.5.1 x 001 003 x)-from the file "multiprocessor Support.

    Neon 17.0.1 - from the file 'filters Gallery.

    Note article 17.0.1 - from the file 'filters Gallery.

    Color NTSC 17.0.1 (2015.5.1 x 001 003 x)-from the file "color NTSC.

    Ocean Ripple 17.0.1 - from the file 'filters Gallery.

    OpenEXR 17.0.1 - from the file "series MultiPlugin"

    Paint the Daubs 17.0.1 - from the file 'filters Gallery.

    17.0.1 palette knife - from the file 'filters Gallery.

    Patchwork 17.0.1 - from the file 'filters Gallery.

    Paths to Illustrator 17.0.1 - from the 'MultiPlugin series' file

    PCX 17.0.1 (2015.5.1 x 001 003 x)-from the file 'PCX.

    Photocopy 17.0.1 - from the file 'filters Gallery.

    3D Photoshop 17.0.1 engine (2015.5.1 x 001 003 x)-from the file 'Photoshop3DEngine '.

    Photoshop Touch 14.0 - from the file 'PSDX '.

    Photo filter package 17.0.1 (2015.5.1 x 001 003 x)-from the file "ChannelPort.

    Pinch 17.0.1 - from the 'MultiPlugin series' file

    Pixar 17.0.1 (2015.5.1 x 001 003 x)-from the file "Pixar".

    Plaster 17.0.1 - from the file 'filters Gallery.

    Plastic wrap 17.0.1 - from the file 'filters Gallery.

    PLY 17.0.1 (2015.5.1 x 001 003 x)-from the file "U3D.

    PNG 17.0.1 - from the file "series MultiPlugin"

    Pointillism 17.0.1 - from the file "series MultiPlugin"

    Polar coordinates 17.0.1 - from the 'MultiPlugin series' file

    Portable Bit Map 17.0.1 (2015.5.1 x 001 003 x)-from the file "PBM".

    Poster edges 17.0.1 - from the file 'filters Gallery.

    People's Republic of CHINA 17.0.1 (2015.5.1 x 001 003 x)-from the file "U3D.

    17.0.1 - from the file 'Series MultiPlugin' radial blur

    17.0.1 radiance (2015.5.1 x 001 003 x)-from the file 'Radiance '.

    17.0.1 range (2015.5.1 x 001 003 x)-from the 'statistics' file

    Grid search of colors made NO VERSION - from the file 'Export3DLUT '.

    Crosslinking 17.0.1 - from the file 'filters Gallery.

    Ripple 17.0.1 - from the file "series MultiPlugin"

    Rough Pastels 17.0.1 - from the file 'filters Gallery.

    Save for Web 17.0.1 - from the file 'save for Web '.

    ScriptingSupport 17.0.1 - from the file "ScriptingSupport."

    Shake Reduction 17.0.1 - from the file "Shake Reduction"

    Shear 17.0.1 - from the file "series MultiPlugin"

    17.0.1 asymmetry (2015.5.1 x 001 003 x)-from the 'statistics' file

    Smart Blur 17.0.1 - from the file "series MultiPlugin"

    Smudge Stick 17.0.1 - from the file 'filters Gallery.

    Solarization 17.0.1 (2015.5.1 x 001 003 x)-from the file "solarization".

    Spaces 17.0.1 - from the file "spaces.

    Splash 17.0.1 - from the file 'filters Gallery.

    Spherize 17.0.1 - from the file "series MultiPlugin"

    Sponge 17.0.1 - from the file 'filters Gallery.

    Strokes sprayed 17.0.1 - from the file 'filters Gallery.

    17.0.1 - from the file «Filters Gallery» stained glass

    Stamp 17.0.1 - from the file 'filters Gallery.

    SD 17.0.1 (2015.5.1 x 001 003 x)-from the 'statistics' file

    STL 17.0.1 (2015.5.1 x 001 003 x)-from the file "U3D.

    Sumi-e 17.0.1 - from the file 'filters Gallery.

    17.0.1 summation (2015.5.1 x 001 003 x)-from the 'statistics' file

    Targa 17.0.1 - from the file "series MultiPlugin"

    Texture veneer 17.0.1 - from the file 'filters Gallery.

    Tiles 17.0.1 - from the 'MultiPlugin series' file

    Torn edges 17.0.1 - from the file 'filters Gallery.

    Twirl 17.0.1 - from the 'MultiPlugin series' file

    U3D 17.0.1 (2015.5.1 x 001 003 x)-from the file "U3D.

    Draft 17.0.1 - from the file 'filters Gallery.

    Vanishing point 17.0.1 - from the file "VanishingPoint".

    Variance 17.0.1 (2015.5.1 x 001 003 x)-from the 'statistics' file

    Virtual Reality Modeling Language. VRML 17.0.1 (2015.5.1 x 001 003 x)-from the file "U3D.

    Water paper 17.0.1 - from the file 'filters Gallery.

    Watercolor 17.0.1 - from the file 'filters Gallery.

    Wave 17.0.1 - from the file "series MultiPlugin"

    Wavefront | OBJ 17.0.1 (2015.5.1 x 001 003 x)-from the file "U3D.

    WIA support 17.0.1 (2015.5.1 x 001 003 x)-from the file 'WIASupport '.

    Wind 17.0.1 - from the file "series MultiPlugin"

    Wireless Bitmap 17.0.1 (2015.5.1 x 001 003 x)-from the file 'WBMP '.

    Zig - zag 17.0.1 - from the file "series MultiPlugin"

    Plug-ins option and third parties:

    Analog Efex Pro 2 2.0.12.12 - in the file "C:\Program Files\Google\Nik Collection\Analog Efex Pro 2\Analog Efex Pro 2 (64-bit) \Analog Efex Pro 2.8bf"

    BackgroundFilter 2.2.21.12 - from the file "C:\Program Files\Google\Nik Collection\Dfine 2\Dfine 2 \Background.8bf (64-Bit)"

    Color Efex Pro 4 4.3.24.12 - from the file "C:\Program Files\Google\Nik Collection\Color Efex Pro 4\Color Efex Pro 4 (64-bit) \Color Efex Pro 4.8bf"

    Dfine 2 2.2.21.12 - in the file "C:\Program Files\Google\Nik Collection\Dfine 2\Dfine 2 \Dfine2.8bf (64-Bit)"

    FineStructuresFilter 2.2.21.12 - from the file "C:\Program Files\Google\Nik Collection\Dfine 2\Dfine 2 \FineStructures.8bf (64-Bit)"

    HDR Efex Pro 2 2.2.24.12 - in the file "C:\Program Files\Google\Nik Collection\HDR Efex Pro 2\HDR Efex Pro 2 (64-bit) \HDR Efex Pro 2.8bf"

    HotPixelsFilter 2.2.21.12 - from the file "C:\Program Files\Google\Nik Collection\Dfine 2\Dfine 2 \HotPixels.8bf (64-Bit)"

    Merge HDR Efex Pro 2 2.2.24.12 - from the file "C:\Program Files\Google\Nik Collection\HDR Efex Pro 2\HDR Efex Pro 2 (64-bit) \HDR Efex Pro 2.8bf"

    Collection Nik selective tool 2.1.28 - from the file "C:\Program Files\Adobe\Adobe Photoshop 2015.5\Plug-ins\Google\Selective Tool\SelectivePalette.8li CC"

    ON1 effects 10 10.0.0 - from the file "C:\Program Files\Adobe\Adobe Photoshop 2015.5\Plug-ins\ON1 effects 10-suite.plugin\PerfectEffects.8li CC"

    ON1 effects 10 10.0.0 - from the file "C:\Program Files\Adobe\Adobe Photoshop 2015.5\Plug-ins\ON1 effects 10-suite.plugin\PerfectEffects.8li CC"

    ON1 effects 10 filter 10.0.0 - from the file "C:\Program Files\Adobe\Adobe Photoshop 2015.5\Plug-ins\ON1 effects 10-suite.plugin\PerfectEffects.8li CC"

    ON1 improve 10 10.0.0 - from the file "C:\Program Files\Adobe\Adobe Photoshop 2015.5\Plug-ins\ON1 Enhance 10-suite.plugin\PerfectEnhanceProxy.8li CC"

    ON1 improve 10 10.0.0 - from the file "C:\Program Files\Adobe\Adobe Photoshop 2015.5\Plug-ins\ON1 Enhance 10-suite.plugin\PerfectEnhanceProxy.8li CC"

    ON1 Enhance 10 filter 10.0.0 - from the file "C:\Program Files\Adobe\Adobe Photoshop 2015.5\Plug-ins\ON1 Enhance 10-suite.plugin\PerfectEnhanceProxy.8li CC"

    ON1 Portrait 10 10.0.0 - from the file "C:\Program Files\Adobe\Adobe Photoshop 2015.5\Plug-ins\ON1 Portrait 10-suite.plugin\PerfectPortraitProxy.8li CC"

    ON1 Portrait 10 10.0.0 - from the file "C:\Program Files\Adobe\Adobe Photoshop 2015.5\Plug-ins\ON1 Portrait 10-suite.plugin\PerfectPortraitProxy.8li CC"

    ON1 Portrait 10 filter 10.0.0 - from the file "C:\Program Files\Adobe\Adobe Photoshop 2015.5\Plug-ins\ON1 Portrait 10-suite.plugin\PerfectPortraitProxy.8li CC"

    ShadowsFilter 2.2.21.12 - from the file "C:\Program Files\Google\Nik Collection\Dfine 2\Dfine 2 \Shadows.8bf (64-Bit)"

    Sharpener Pro 3: (1) RAW Presharpener 3.1.21.12 - from the file "C:\Program Files\Google\Nik Collection\Sharpener Pro 3\Sharpener Pro 3 (64-bit) \SHP3RPS.8bf"

    Sharpener Pro 3: output sharpener (2) 3.1.21.12 - from the file "C:\Program Files\Google\Nik Collection\Sharpener Pro 3\Sharpener Pro 3 (64-bit) \SHP3OS.8bf"

    Silver Efex Pro 2 2.2.24.12 - in the file "C:\Program Files\Google\Nik Collection\Silver Efex Pro 2\Silver Efex Pro 2 (64-bit) \Silver Efex Pro 2.8bf"

    SkinFilter 2.2.21.12 - from the file "C:\Program Files\Google\Nik Collection\Dfine 2\Dfine 2 \Skin.8bf (64-Bit)"

    SkyFilter 2.2.21.12 - from the file "C:\Program Files\Google\Nik Collection\Dfine 2\Dfine 2 \Sky.8bf (64-Bit)"

    StrongNoiseFilter 2.2.21.12 - from the file "C:\Program Files\Google\Nik Collection\Dfine 2\Dfine 2 \StrongNoise.8bf (64-Bit)"

    Viveza 2 2.1.21.12 - in the file "C:\Program Files\Google\Nik Collection\Viveza 2\Viveza 2 \Viveza2.8bf (64-Bit)"

    Duplicates and plug-ins disabled: NONE

    Plug-ins that could not load: NONE

    Extensions:

    Recent files 1.2.1 - from the file "C:\Program Files (x 86) \Common.

    com.adobe.InApp.Purchase 2.6.64 - from the file "C:\Program Files (x 86) \Common.

    Library 2.6.64 - from the file "C:\Program Files (x 86) \Common.

    Leave 1.2.1 - the file ' C:\Program Files (x 86) \Common.

    ON1 1.0.0 - from the file "C:\Program Files (x 86) \Common.

    Color Adobe 6.1.0 - from the file "C:\Program Files\Adobe\Adobe Photoshop 2015.5\Required\CEP\extensions\com.adobe.KulerPanel.html\index.html CC" themes

    Export as 3.0.6 - from the file "C:\Program Files\Adobe\Adobe Photoshop 2015.5\Required\CEP\extensions\com.adobe.photoshop.crema\PSPanel\dialog.html CC"

    Overview of unit 1.2.0 - from the file "C:\Program Files\Fichiers Files\Adobe\CEP\extensions\com.adobe.preview20155\PSPanel\panel.html"

    Raya Pro 1.1.0 - from the file ' C:\Users\Debra\AppData\Roaming\Adobe\CEP\extensions\com. JM. RayaPro\index.html ".

    com.adobe.preview.Loader 1.2.0 - from the file "C:\Program Files\Fichiers Files\Adobe\CEP\extensions\com.adobe.preview20155\PSLoader\loader.html"

    Export as 3.0.6 - from the file "C:\Program Files\Adobe\Adobe Photoshop 2015.5\Required\CEP\extensions\com.adobe.photoshop.crema\PSPanel\dialog.html CC"

    Install TWAIN devices: NONE

    Hi Debral,

    Could you please go to control panel and fix Microsoft Visual C++ 2012, 2013 and 2015.

    Restart the computer and then try to open the bridge and please let me know if it works.

    Kind regards

    Sahil

  • Error when you use the Application Loader

    When I try to download my application in with the application loader, I get this message:

    In iTunes Connect, newsstand is enabled for your version of the app. The Info.plist file must include UINewsstandApp = true and CFBundleIcons.UINewsstandIcon dictionary must be specified.

    I submit multi-folio.

    Please help guys!

    In App Builder you must select one of the types of viewer that includes "iTunes subscription. Then elaborate on the newsstand and subscription details pages.

    Neil

  • ODI error when loading classic HFM Application data

    Hi all

    I'm the one stage integration of the source (flat file) at the request of HFM, I created it and loading data integration, I get the following error: -.

    org.apache.bsf.BSFException: exception of Jython:

    Traceback (most recent call changed):

    File '< string >", line 3, in < module >

    at com.hyperion.odi.hfm.ODIHFMAppWriter.loadData(ODIHFMAppWriter.java:240)

    at sun.reflect.NativeMethodAccessorImpl.invoke0 (Native Method)

    at sun.reflect.NativeMethodAccessorImpl.invoke(NativeMethodAccessorImpl.java:39)

    at sun.reflect.DelegatingMethodAccessorImpl.invoke(DelegatingMethodAccessorImpl.java:25)

    at java.lang.reflect.Method.invoke(Method.java:597)

    com.hyperion.odi.common.ODIHAppException: com.hyperion.odi.common.ODIHAppException: [CLEAR_ALL_METADATA_BEFORE_LOAD, REPLACE_MODE] properties are required.

    at org.apache.bsf.engines.jython.JythonEngine.exec(JythonEngine.java:146)

    at com.sunopsis.dwg.codeinterpretor.SnpScriptingInterpretor.execInBSFEngine(SnpScriptingInterpretor.java:322)

    at com.sunopsis.dwg.codeinterpretor.SnpScriptingInterpretor.exec(SnpScriptingInterpretor.java:170)

    at com.sunopsis.dwg.dbobj.SnpSessTaskSql.scripting(SnpSessTaskSql.java:2472)

    at oracle.odi.runtime.agent.execution.cmd.ScriptingExecutor.execute(ScriptingExecutor.java:47)

    at oracle.odi.runtime.agent.execution.cmd.ScriptingExecutor.execute(ScriptingExecutor.java:1)

    at oracle.odi.runtime.agent.execution.TaskExecutionHandler.handleTask(TaskExecutionHandler.java:50)

    at com.sunopsis.dwg.dbobj.SnpSessTaskSql.processTask(SnpSessTaskSql.java:2913)

    at com.sunopsis.dwg.dbobj.SnpSessTaskSql.treatTask(SnpSessTaskSql.java:2625)

    at com.sunopsis.dwg.dbobj.SnpSessStep.treatAttachedTasks(SnpSessStep.java:577)

    at com.sunopsis.dwg.dbobj.SnpSessStep.treatSessStep(SnpSessStep.java:468)

    at com.sunopsis.dwg.dbobj.SnpSession.treatSession(SnpSession.java:2128)

    to oracle.odi.runtime.agent.processor.impl.StartSessRequestProcessor$ 2.doAction(StartSessRequestProcessor.java:366)

    at oracle.odi.core.persistence.dwgobject.DwgObjectTemplate.execute(DwgObjectTemplate.java:216)

    at oracle.odi.runtime.agent.processor.impl.StartSessRequestProcessor.doProcessStartSessTask(StartSessRequestProcessor.java:300)

    to oracle.odi.runtime.agent.processor.impl.StartSessRequestProcessor.access$ 0 (StartSessRequestProcessor.java:292)

    to oracle.odi.runtime.agent.processor.impl.StartSessRequestProcessor$ StartSessTask.doExecute (StartSessRequestProcessor.java:855)

    at oracle.odi.runtime.agent.processor.task.AgentTask.execute(AgentTask.java:126)

    to oracle.odi.runtime.agent.support.DefaultAgentTaskExecutor$ 2.run(DefaultAgentTaskExecutor.java:82)

    at java.lang.Thread.run(Thread.java:662)

    Caused by: Traceback (most recent call changed):

    File '< string >", line 3, in < module >

    at com.hyperion.odi.hfm.ODIHFMAppWriter.loadData(ODIHFMAppWriter.java:240)

    at sun.reflect.NativeMethodAccessorImpl.invoke0 (Native Method)

    at sun.reflect.NativeMethodAccessorImpl.invoke(NativeMethodAccessorImpl.java:39)

    at sun.reflect.DelegatingMethodAccessorImpl.invoke(DelegatingMethodAccessorImpl.java:25)

    at java.lang.reflect.Method.invoke(Method.java:597)

    com.hyperion.odi.common.ODIHAppException: com.hyperion.odi.common.ODIHAppException: [CLEAR_ALL_METADATA_BEFORE_LOAD, REPLACE_MODE] properties are required.

    at org.python.core.PyException.fillInStackTrace(PyException.java:70)

    at java.lang.Throwable. < init > (Throwable.java:181)

    at java.lang.Exception. < init > (Exception.java:29)

    to java.lang.RuntimeException. < init > (RuntimeException.java:32)

    to org.python.core.PyException. < init > (PyException.java:46)

    to org.python.core.PyException. < init > (PyException.java:43)

    at org.python.core.Py.JavaError(Py.java:455)

    at org.python.core.Py.JavaError(Py.java:448)

    at org.python.core.PyReflectedFunction.__call__(PyReflectedFunction.java:177)

    at org.python.core.PyObject.__call__(PyObject.java:355)

    at org.python.core.PyMethod.__call__(PyMethod.java:215)

    at org.python.core.PyMethod.instancemethod___call__(PyMethod.java:221)

    at org.python.core.PyMethod.__call__(PyMethod.java:206)

    at org.python.core.PyObject.__call__(PyObject.java:397)

    at org.python.core.PyObject.__call__(PyObject.java:401)

    to org.python.pycode._pyx15.f$ 0 (< string >: 6)

    to org.python.pycode._pyx15.call_function (< string >)

    at org.python.core.PyTableCode.call(PyTableCode.java:165)

    at org.python.core.PyCode.call(PyCode.java:18)

    at org.python.core.Py.runCode(Py.java:1204)

    at org.python.core.Py.exec(Py.java:1248)

    at org.python.util.PythonInterpreter.exec(PythonInterpreter.java:172)

    at org.apache.bsf.engines.jython.JythonEngine.exec(JythonEngine.java:144)

    ... 19 more

    Caused by: com.hyperion.odi.common.ODIHAppException: [CLEAR_ALL_METADATA_BEFORE_LOAD, REPLACE_MODE] properties are required.

    at com.hyperion.odi.hfm.ODIHFMAppWriter.loadData(ODIHFMAppWriter.java:240)

    at sun.reflect.NativeMethodAccessorImpl.invoke0 (Native Method)

    at sun.reflect.NativeMethodAccessorImpl.invoke(NativeMethodAccessorImpl.java:39)

    at sun.reflect.DelegatingMethodAccessorImpl.invoke(DelegatingMethodAccessorImpl.java:25)

    at java.lang.reflect.Method.invoke(Method.java:597)

    at org.python.core.PyReflectedFunction.__call__(PyReflectedFunction.java:175)

    ... more than 33

    Caused by: com.hyperion.odi.common.ODIHAppException: [CLEAR_ALL_METADATA_BEFORE_LOAD, REPLACE_MODE] properties are required.

    at com.hyperion.odi.hfm.ODIHFMUtil.validateRequiredProperties(ODIHFMUtil.java:87)

    to com.hyperion.odi.hfm.ODIHFMMetadataLoader$ OptionsMetadataLoad.validate (ODIHFMMetadataLoader.java:66)

    at com.hyperion.odi.hfm.ODIHFMMetadataLoader.validateOptions(ODIHFMMetadataLoader.java:188)

    at com.hyperion.odi.hfm.ODIHFMAppStatement.validateLoadOptions(ODIHFMAppStatement.java:168)

    at com.hyperion.odi.hfm.ODIHFMAppWriter.loadData(ODIHFMAppWriter.java:195)

    ... more than 38

    Any help appreciated

    Thank you

    Pratik

    Hi all

    Thanks for the help!

    I solved the error

    Solution:-j' used the double model i.e HFMData copy data, so what I thought was to use the original data model, IE HFMData.

    Generally, we use one duplicate, but here is not the way.

    Thank you

    Pratik

  • I have an A12E6 error when downloading and installing applications

    I have a

    cordially Arold

    Arold salvation,

    Welcome to the Forums

    http://forums.Adobe.com/thread/1197816 or http://forums.adobe.com/thread/1291134 can help,

    Thank you!

    Florianne

  • DW 2014CC 1.1 build 6981 continues to display a "Server busy" error when you start the application.

    After clicking on the icon of DW in my Windows start 8.1 the flash screen opens and crashes until a pop-up dialog box appears asking me to select which instance of DW I want - there is no other instance running.

    The two dialog box options "switch to...» ' or 'Retry '. Try clicking the exit cross is not possible and 'Retry' has no observable effect.

    On tapping "switch to...» "button immediately shows the start menu, so I select the DW icon. This Mulberry Bush happens several times until the DW workspace appears but is unusable until I cleared a few cases most of the dialog box. Often the session of DW dialog box appears again to clear manually.

    This happens (so far) on my workstation, no cell phone,

    Rgds,

    Neil.

    I have exactly the same problem and looking back through the forums it seems that this bug lasts for a long time with out being fixed by Adobe.

    I'm working on a clients Web site at the mo, so it costs me money. More money, I'm shelling out for DW itself.

    Difficulty to anyone?

Maybe you are looking for