Error 53 error 1671

6, 16 GB iPhone. Running iOS 9.0

Contact ID did not work when I tried updating to the latest iOS via the computer that is running windows 10. Thus, he bricked with error 53.

Once apple has released a fix in 9.2.1 iOS I tried to update.  Now display error 1671.

The iPhone is still having old ID dysfunctional touch, never replaced.

Is there a solution to this problem?

If the TouchID was faulty and that your phone was never repaired by any unauthorized person, take it to Apple and ask them to fix it. If it is under warranty, it should cost nothing.

Tags: iPhone

Similar Questions

  • trying to update my locked apple iPad 2.  has received the error 1671. What should I do?

    My iPad 2 is locked to try to enter the incorrect password.  I use it in my bakery and someone must have been playing with it.  Now, I ran out of time to try and it is locked.  I tried to erase everything and, when I did I got the error 1671. Help.

    Hello SGJ663,

    Sorry to hear about the problems you are having with your iPad. The good news is that there is a solution for your problem. In the case where you have locked your iPad with mistyped password six times, you will need to connect your iPad to your Mac or PC and do a full restore from iTunes.

    Please follow the instructions available on the following link.

    https://support.Apple.com/en-us/HT204306

    This support article will give you all the information you will need to clean your iPad and regain access. If you have already gone through the process described by the aforementioned article, please make an appointment with your Genius Bar local so that you can receive additional assistance. To find an Apple store in your area, please visit http://www.apple.com/retail/ and search for the nearest store. Once you have performed the search, use the list to find the store nearest. From there, select a store and you will be taken to the page for said store where you can make a reservation with the Genius Bar.

    Good luck to regain access to your iPad.

  • iPad pro error 1671

    IPad Pro

    Update to IOS 9.3.1 via the latest version of iTunes.

    The iPad has not accepted the original code of pass

    After several attempts, the ipad is now disabled.

    It looks like the wrong password, but it was good.

    It is impossible to restore the iPad, 1671 error keeps appearing

    I've tried everything recommended by Apple, as turn off und software uninstallation of security, direct USB connection, wifi cut and the hotspot of the iphone feature, nothing works.

    Is there a cure?

    Hello jaypy,

    Thank you for using communities of Apple Support.

    I understand that your password has been entered too often badly and now your iPad is disabled.  You'll need to clear the iPad in order to move forward.  Please follow the steps below to set mode of recovery and restoration of the iPad.

    1. Connect your iOS device to your computer and open iTunes. If you don't have a computer, borrow one from a friend, or go to an Apple Store or Apple authorized service provider.
    2. When your device is connected, force restart it: press and hold buttons sleep/wake and Home at the same time. Do not let go when you see the Apple logo - keep pressed until you see on the screen in recovery mode.
    3. When you see the option restore or put to update, choose restore.

      iTunes will download software for your device. If it takes more than 15 minutes, your device will exit Recovery mode and you need to repeat steps 2 and 3.
    4. Until the end of the process. Then, you can Configure and use your device.

    If you have forgotten the password for your iPhone, iPad or iPod touch, or your device is disabled

    Take care.

  • What to do if the 1671 error while I restore my Iphone?

    My 9 year old son has forgotten his password on his IPhone 4 s. I started to restore it and then a message appears with the text - iPhone software update server could not be contacted. An unknown error occurred (1671). How could I resolve and restore the iPhone?

    Have you already checked this discussion?

    Re: Woman tries to update its ipad 2 to 9.1 and eventually error 1671.

    If you see the error 1671, iTunes is downloading the necessary software. Wait for the download to the end and try again. To see how long the download should take, you can click on the arrow down on the upper right of iTunes.

    If you see any of the questions below, it may be that your computer may not be able to connect to servers Apple or your iPhone, iPad or iPod touch:

    • 17, 1638, 3014, 3194, 3000, 3002, 3004, 3013, 3014, 3015, 3194, 3200
    • "There was a problem downloading the software."
    • "The device is not eligible for the requested build."

    Search for communication problems between iTunes and Apple - server software update. If you still see the error message, look for problems with third-party security software.

    copied from: get help with iOS update and restore errors

  • Error of 1671

    I do it two times but I failed to get it back, it seems even i tunes logo and there is an icon of cable... I received error messages 1671 code... When I update and restore it appears same procedure... Help, please

    The responses in these discussions can help:

    Error Iphone5s IOS 9.0.1 1671

    Error 1671!

    What is an average of 1671 error code and 1617?

  • 1671 iphone update error message

    Trying to update my phone, but the error message that is not on the list of support 1671.

    Disable the antivirus software on your computer

  • I'm trying to restore my mini ipad settings but 1671 error keeps popping up. Someone at - it ideas?

    I'm trying to restore my mini ipad settings but 1671 error keeps popping up. Someone at - it ideas?

    This might be useful.

    error are not not in the official list

    Get help with iOS update or restore errors - Apple Support

  • Earlier, I sent a message on my Ipad. The error code was of 1671

    I was updating my 2 Ipsad and accidentally rebooted automation while it was always up to date and that he put away. I now have a screen with the ITunes logo and a usb cable to this topic. I tried to restore the unit via ITunes on my PC. It gives me an error code (1671) anyone can give me help or is this Ipad trashed. I'd appreciate any help anyone could give me

    This person asked the same question.  My answer is the same as well.

    I downloaded the 9.2 update my iPad 2 and it has now disappeared vacuum with a plug-in iTunes symbol. I did it and my computer could not update. I get an error message 1671.

  • Fix disabled iPad

    Im trying to update or restore my mini iPad after my daughter locked and does not know the access code.  I followed the instructions on iTunes to update and restore but I get an error 1671. Can anyone help?

    See get help with iOS update and restore errors - Apple Support.

    Search for communication problems

    If you see the error 1671, iTunes is downloading the necessary software. Wait for the download to the end and try again. To see how long the download should take, you can click on the arrow down on the upper right of iTunes.

    If you see any of the questions below, it may be that your computer may not be able to connect to servers Apple or your iPhone, iPad or iPod touch:

    • 17, 1638, 3014, 3194, 3000, 3002, 3004, 3013, 3014, 3015, 3194, 3200
    • "There was a problem downloading the software."
    • "The device is not eligible for the requested build."

    Search for communication problems between iTunes and Apple - server software update. Check also for the problems with third-party security software.

    If you still see an error message, contact The Apple support.

  • last update to iphone6plus

    Try installing the latest iOS on iPhone6 9.3.1 more.  Cannot depend on phone the screen was just a lead to iTunes top logo.  Have connected to iTunes on the laptop.  But after 50 minutes to try to download a message arrives that it is unable to do so and iPhone needs to be restored.  Hit restore button and a box comes up saying error 1671.  Went through all the suggestions such as the laptop computer audit has the latest updates and turn off and turn back on again.  This happened also to the iOS 9.3, but finally he installed after trying several times.

    Tried calling Apple support several times but they are very busy and the waiting time is very long and then you get cut.

    Any suggestions as to what to do?

    Hello..

    Try the "solved" posted by Philly_Phanon this discussion > last IOS poster code failure 1671, that mean?

  • Now PATCHED: Player QuickTime Streaming Debug Error Logging buffer overflow

    The following was copied/pasted from http://secunia.com/advisories/40729/

    Description
    Krystian Kloskowski has found out a [critical] vulnerability in QuickTime Player, which can be exploited by malicious people to compromise a user's system.

    The vulnerability is due to an error of border in QuickTimeStreaming.qtx during the construction of a string to write to a debug log file. This can be exploited to cause a stack-based buffer overflow for example tricking a user in the display of a malicious web page that references a file SMIL containing a URL that is too long.

    A successful exploitation allows execution of arbitrary code.

    The vulnerability is confirmed in version 7.6.6 (1671) for Windows. Other versions may also be affected.

    [NO] Solution
    A hotfix or an update is not currently available.

    EDIT: Due to this vulnerability in QuickTime, Secunia reports now all my browswers (IE, FF, Opera) as being insecure.

    QuickTime 7.6. 7 was released http://www.apple.com/quicktime/download/ ;

    and Secunia PSI removed this vulnerability to his list of (In) Secure Browsing.

  • Error (ORA-12547) while trying to create a database on AWS ec2

    Hello world

    I am trying to install Oracle 12 c DB on an Amazon ec2 'Machine' (RHEL 7.1).

    Start the Machine, unzip the files (12.1.0.2.0 for x 86-64 Linux download from OTN) and installation of the database to help. / runInstaller succeeded. But when I am trying to create a database now, it fails with the "ORA-12547: TNS: lost contact" error.

    That's what I entered:

    [data [email protected]] $ dbca-silent - createDatabase.

    -templateName General_Purpose.dbc.

    gdbname-cdb1 sid cdb1 - responsefile NO_VALUE.

    -characterSet AL32UTF8------.

    -sysPassword OraPasswd1.

    -systemPassword OraPasswd1.

    true - createAsContainerDatabase.

    -numberOfPDBs 1.

    pdbName - pdb1------.

    -pdbAdminPassword OraPasswd1.

    databaseType - MULTIPURPOSE.

    false - automaticMemoryManagement.

    -storageType FS.

    -ignorePreReqs

    That's what the console showed:

    Cleaning of the steps failed

    DBCA_PROGRESS: 4%

    Copying database files

    DBCA_PROGRESS: 5%

    ORA-12547: TNS: lost contact

    DBCA_PROGRESS: 7%

    The cataloguing of backups RMAN error

    DBCA_PROGRESS: DBCA operation failed.

    Examine the log file ' / u01/app/oracle/cfgtoollogs/dbca/cdb1/cdb117.log ' for details.

    Here are the contents of cdb117.log:

    The database Configuration Wizard failed to detect options for the Installation of Oracle.

    ORA-12547: TNS: lost contact

    Because of this failure certain features of the database Configuration Wizard will be unavailable. Do you want to continue?

    Checking database unique identifier passed.

    / has enough space. Space required is 7665 MB, available space is 17768 MB.

    File of successful Validations.

    Cleaning of the steps failed

    DBCA_PROGRESS: 4%

    Copying database files

    DBCA_PROGRESS: 5%

    ORA-12547: TNS: lost contact

    DBCA_PROGRESS: 7%

    The cataloguing of backups RMAN error

    DBCA_PROGRESS: DBCA operation failed.

    And here is the content of the file trace.log:

    [main] [2015-11-11 04:04:19.802 EST] [Host. < init >: 1090]  Start tracing...

    [main] [2015-11-11 04:04:19.874 EST] [SilentHost.initialize:187]  SilentHost-> initialization: m_tempLogFile = /u01/app/oracle/cfgtoollogs/dbca/silent.log_2015-11-11_04-04-19-AM

    [main] [2015-11-11 04:04:19.877 EST] [Host.checkIfBigClusterAndHubNode:1710]  Not a cluster environment: out BigCluster Check

    [main] [2015-11-11 04:04:19.877 EST] [InventoryUtil.getOracleBase:149]  ORACLE_BASE to get inventory.

    [main] [2015-11-11 04:04:19.879 EST] Setting [InventoryUtil.getOUIInvSession:349] YES READ at ACCESSLEVEL_READ_LOCKLESS

    [main] [2015-11-11 04:04:19.879 EST] [InventoryUtil.getOracleBase:164]  The size of the inventory home = 1

    [main] [2015-11-11 04:04:19.901 EST] [InventoryUtil.getOracleBase:189]  ORACLE_BASE returned from inventory: = / u01/app/oracle

    [main] [2015-11-11 04:04:19.901 EST] [Host.displayOracleBaseWarning:1750] oracleBaseFromEnv null

    [main] [2015-11-11 04:04:19.902 EST] [Host.displayOracleBaseWarning:1756] oracle_base to oracle_base/u01/app/oracle YES env/u01/app/oracle

    [main] [2015-11-11 04:04:19.903 EST] Setting [InventoryUtil.getOUIInvSession:349] YES READ at ACCESSLEVEL_READ_LOCKLESS

    [main] [2015-11-11 04:04:19.903 EST] [InventoryUtil.isCRSHome:386]  HomeInfo /u01/app/oracle/product/12.1.0.2/db_1,1

    [main] [2015-11-11 04:04:20.135 EST] [Host.validateGridHome:3878]  Fake of validation

    [main] [2015-11-11 04:04:20.135 EST] [Host.startOperation:2395]  Source db null

    [main] [2015-11-11 04:04:20.135 EST] [Host.startOperation:2396]  Cdb1 name of GDB

    [main] [2015-11-11 04:04:20.152 EST] [Host.startOperation:2397]  Sid - MGMTDB MgmtDB

    [main] [2015-11-11 04:04:20.152 EST] [Host.startOperation:2398]  MgmtDB name _mgmtdb

    [main] [2015-11-11 04:04:20.152 EST] [HADatabaseUtils.isGridMgmtDB:2842]  Mgmt DBName srvm _mgmtdb

    [main] [2015-11-11 04:04:20.155 EST] [OracleHome.getVersion:991]  Called OracleHome.getVersion.  Current version: null

    [main] [2015-11-11 04:04:20.157 EST] Setting [InventoryUtil.getOUIInvSession:349] YES READ at ACCESSLEVEL_READ_LOCKLESS

    [main] [2015-11-11 04:04:20.157 EST] [OracleHome.getVersion:1010]  HomeInfo /u01/app/oracle/product/12.1.0.2/db_1,1

    [main] [2015-11-11 04:04:20.252 EST] [OracleHome.getVersion:1038]  OracleHome.server.getVersion Version: 12.1.0.2.0

    [main] [2015-11-11 04:04:20.252 EST] [OracleHome.getVersion:1059]  The current Version of the inventory: 12.1.0.2.0

    [main] [2015-11-11 04:04:20.252 EST] [OracleHome.getVersion:991]  Called OracleHome.getVersion.  Current version: 12.1.0.2.0

    [main] [2015-11-11 04:04:20.252 EST] [OracleHome.getVersion:1059]  The current Version of the inventory: 12.1.0.2.0

    [main] [2015-11-11 04:04:20.252 EST] [CommonUtils.createPasswordFile:1243] orapwd new appeal for 11.1 or above

    [main] [2015-11-11 04:04:20.253 EST] [OracleHome.getVersion:991]  Called OracleHome.getVersion.  Current version: 12.1.0.2.0

    [main] [2015-11-11 04:04:20.253 EST] [OracleHome.getVersion:1059]  The current Version of the inventory: 12.1.0.2.0

    [main] [2015-11-11 04:04:20.253 EST] [OracleHome.getVersion:991]  Called OracleHome.getVersion.  Current version: 12.1.0.2.0

    [main] [2015-11-11 04:04:20.253 EST] [OracleHome.getVersion:1059]  The current Version of the inventory: 12.1.0.2.0

    [main] [2015-11-11 04:04:20.253 EST] [CommonUtils.getPasswordFileCreateCmd:1182] for new orapwd to 11.1 or above

    [main] [2015-11-11 04:04:20.255 EST] [OracleHome.getVersion:991]  Called OracleHome.getVersion.  Current version: 12.1.0.2.0

    [main] [2015-11-11 04:04:20.256 EST] [OracleHome.getVersion:1059]  The current Version of the inventory: 12.1.0.2.0

    [main] [2015-11-11 04:04:20.256 EST] [OracleHome.getVersion:991]  Called OracleHome.getVersion.  Current version: 12.1.0.2.0

    [main] [2015-11-11 04:04:20.256 EST] [OracleHome.getVersion:1059]  The current Version of the inventory: 12.1.0.2.0

    [main] [2015-11-11 04:04:20.256 EST] /U01/app/oracle/product/12.1.0.2/db_1/bin/orapwd [CommonUtils.getPasswordFileCreateCmd:1213]

    [main] [2015-11-11 04:04:20.256 EST] File=/U01/app/Oracle/product/12.1.0.2/Db_1/DBS/orapwDBUA0420152 [CommonUtils.getPasswordFileCreateCmd:1213]

    [main] [2015-11-11 04:04:20.256 EST] Force [CommonUtils.getPasswordFileCreateCmd:1213] = y

    [main] [2015-11-11 04:04:20.256 EST] [CommonUtils.getPasswordFileCreateCmd:1213] format = 12

    [main] [2015-11-11 04:04:20.257 EST] [OsUtilsBase.execProg:2123] start execProg with the input array.

    [main] [2015-11-11 04:04:20.272 EST] [OsUtilsBase.execProg:2160] done execProg with the input array. Status: 0

    [main] [2015-11-11 04:04:20.272 EST] [OracleHome.initOptionsStopOnError:1356]  Initialization of the database Options with dummy sid = DBUA0420152 using initfile=/u01/app/oracle/product/12.1.0.2/db_1/dbs/initDBUA0420152.ora using pwdfile=/u01/app/oracle/product/12.1.0.2/db_1/dbs/orapwDBUA0420152

    [main] [2015-11-11 04:04:20.274 EST] [OracleHome.getVersion:991]  Called OracleHome.getVersion.  Current version: 12.1.0.2.0

    [main] [2015-11-11 04:04:20.274 EST] [OracleHome.getVersion:1059]  The current Version of the inventory: 12.1.0.2.0

    [main] [2015-11-11 04:04:20.274 EST] [OracleHome.getVersion:991]  Called OracleHome.getVersion.  Current version: 12.1.0.2.0

    [main] [2015-11-11 04:04:20.275 EST] [OracleHome.getVersion:1059]  The current Version of the inventory: 12.1.0.2.0

    [main] [2015-11-11 04:04:20.275 EST] [OracleHome.getVersion:991]  Called OracleHome.getVersion.  Current version: 12.1.0.2.0

    [main] [2015-11-11 04:04:20.275 EST] [OracleHome.getVersion:1059]  The current Version of the inventory: 12.1.0.2.0

    [main] [2015-11-11 04:04:20.275 EST] [SQLPlusEngine.getCmmdParams:225] m_home 12.1.0.2.0

    [main] [2015-11-11 04:04:20.275 EST] True for 112 > version [SQLPlusEngine.getCmmdParams:226]

    [main] [2015-11-11 04:04:20.276 EST] [SQLEngine.getEnvParams:602]  By default the NLS_LANG: AMERICAN_AMERICA. AL32UTF8

    [main] [2015-11-11 04:04:20.276 EST] [SQLEngine.getEnvParams:612]  NLS_LANG: AMERICAN_AMERICA. AL32UTF8

    [main] [2015-11-11 04:04:20.277 EST] [SQLEngine.initialize:358]  SQLPLUS/OPEN process execing...

    [main] [2015-11-11 04:04:20.288 EST] M_bReaderStarted [SQLEngine.initialize:395]: false

    [main] [2015-11-11 04:04:20.288 EST] [SQLEngine.initialize:399]  From the wire drive...

    [main] [2015-11-11 04:04:20.302 EST] [SQLEngine.done:2278]  Called

    [main] [2015-11-11 04:04:20.302 EST] [OracleHome.initOptionsStopOnError:1409]  ORA-12547: TNS: lost contact

    [main] [2015-11-11 04:04:20.303 EST] [OracleHome.initOptionsStopOnError:1410]  ORA-12547: TNS: lost contact

    oracle.sysman.assistants.util.sqlEngine.SQLEngine.executeImpl(SQLEngine.java:1739)

    oracle.sysman.assistants.util.sqlEngine.SQLEngine.connect(SQLEngine.java:987)

    oracle.sysman.assistants.util.OracleHome.initOptionsStopOnError(OracleHome.java:1362)

    oracle.sysman.assistants.dbca.backend.Host.startOperation(Host.java:2411)

    oracle.sysman.assistants.dbca.Dbca.execute(Dbca.java:153)

    oracle.sysman.assistants.dbca.Dbca.main (Dbca.java:226)

    [main] [2015-11-11 04:04:20.303 EST] [OracleHome.initOptionsStopOnError:1419] closing dummy instance

    [main] [2015-11-11 04:04:20.303 EST] [SQLEngine.reInitialize:785]  The SQLEngine reset...

    [main] [2015-11-11 04:04:20.303 EST] [OracleHome.getVersion:991]  Called OracleHome.getVersion.  Current version: 12.1.0.2.0

    [main] [2015-11-11 04:04:20.303 EST] [OracleHome.getVersion:1059]  The current Version of the inventory: 12.1.0.2.0

    [main] [2015-11-11 04:04:20.303 EST] [OracleHome.getVersion:991]  Called OracleHome.getVersion.  Current version: 12.1.0.2.0

    [main] [2015-11-11 04:04:20.304 EST] [OracleHome.getVersion:1059]  The current Version of the inventory: 12.1.0.2.0

    [main] [2015-11-11 04:04:20.304 EST] [OracleHome.getVersion:991]  Called OracleHome.getVersion.  Current version: 12.1.0.2.0

    [main] [2015-11-11 04:04:20.304 EST] [OracleHome.getVersion:1059]  The current Version of the inventory: 12.1.0.2.0

    [main] [2015-11-11 04:04:20.304 EST] [SQLPlusEngine.getCmmdParams:225] m_home 12.1.0.2.0

    [main] [2015-11-11 04:04:20.304 EST] True for 112 > version [SQLPlusEngine.getCmmdParams:226]

    [main] [2015-11-11 04:04:20.305 EST] [SQLEngine.getEnvParams:602]  By default the NLS_LANG: AMERICAN_AMERICA. AL32UTF8

    [main] [2015-11-11 04:04:20.305 EST] [SQLEngine.getEnvParams:612]  NLS_LANG: AMERICAN_AMERICA. AL32UTF8

    [main] [2015-11-11 04:04:20.305 EST] [SQLEngine.initialize:358]  SQLPLUS/OPEN process execing...

    [main] [2015-11-11 04:04:20.316 EST] M_bReaderStarted [SQLEngine.initialize:395]: false

    [main] [2015-11-11 04:04:20.316 EST] [SQLEngine.initialize:399]  From the wire drive...

    [main] [2015-11-11 04:04:20.317 EST] [SQLEngine.initialize:448]  Waiting for m_bReaderStarted to be true

    [main] [2015-11-11 04:04:20.336 EST] [SQLEngine.done:2278]  Called

    [main] [2015-11-11 04:04:20.336 EST] [OracleHome.initOptionsStopOnError:1426] fake closing instance failed

    [main] [2015-11-11 04:04:20.336 EST] [OracleHome.initOptionsStopOnError:1458]  Data bases query options: 0

    [main] [2015-11-11 04:04:20.337 EST] [Host.checkOPS:2082]  Domestic CheckOPS

    [main] [2015-11-11 04:04:20.337 EST] [Host.checkOPS:2094]  Try to check the existence of cluster

    [main] [2015-11-11 04:04:20.337 EST] [Host.checkOPS:2099] cluster existence: false

    [main] [2015-11-11 04:04:20.337 EST] [Host.checkOPS:2108]  Fake installed cluster

    [main] [2015-11-11 04:04:20.337 EST] [Host.checkOPS:2124]  Cluster installed = false

    [main] [2015-11-11 04:04:20.455 EST] [TemplateManager.validateTemplate:636]  Validation of the model's success

    [main] [2015-11-11 04:04:20.458 EST] [HADatabaseUtils.isGridMgmtDB:2842]  Mgmt DBName srvm _mgmtdb

    [main] [2015-11-11 04:04:20.458 EST] [HAUtils.getCurrentOracleHome:593]  Home of the Oracle system property: /u01/app/oracle/product/12.1.0.2/db_1

    [main] [2015-11-11 04:04:20.458 EST] [HAUtils.getConfiguredGridHome:1343] - HOUSE of CRS.

    [main] [2015-11-11 04:04:20.458 EST] [UnixSystem.getCRSHome:2878] olrFileName = /etc/oracle/olr.loc

    [main] [2015-11-11 04:04:20.458 EST] [HAUtils.getHASHome:1500]  Could not get at home.

    PRCI-1144: Impossible to retrieve the path home Oracle Grid Infrastructure

    PRKC-1144: File ' / etc/oracle/olr.loc ' not found.

    [main] [2015-11-11 04:04:20.459 EST] [StepContext.setListenersToUpdate:946] needLocalListener = false

    [main] [2015-11-11 04:04:20.462 EST] [OracleHome.hasEELicense:247]  Running script to determine licensing: /u01/app/oracle/product/12.1.0.2/db_1/bin/bndlchk

    [main] [2015-11-11 04:04:20.489 EST] Home=/U01/app/Oracle/product/12.1.0.2/Db_1 [OracleHome.hasEELicense:258] has EE licenses

    [main] [2015-11-11 04:04:20.490 EST] [OracleHome.isDatabaseOptionOn:1251]  Audit database option: space

    [main] [2015-11-11 04:04:20.490 EST] [OracleHome.isDatabaseOptionOn:1308]  Spatial database option is false

    [main] [2015-11-11 04:04:20.496 EST] [OracleHome.isDatabaseOptionOn:1251]  Option to check database: OLAP

    [main] [2015-11-11 04:04:20.496 EST] [OracleHome.isDatabaseOptionOn:1308]  Database OLAP Option is false

    [main] [2015-11-11 04:04:20.497 EST] [OracleHome.hasEELicense:247]  Running script to determine licensing: /u01/app/oracle/product/12.1.0.2/db_1/bin/bndlchk

    [main] [2015-11-11 04:04:20.507 EST] Home=/U01/app/Oracle/product/12.1.0.2/Db_1 [OracleHome.hasEELicense:258] has EE licenses

    [main] [2015-11-11 04:04:20.509 EST] [InitParamHandler.endElement:547]  CustomSGA flag: false

    [main] [2015-11-11 04:04:20.509 EST] [InitParamHandler.endElement:548]  Database Type: MULTIFUNCTION

    [main] [2015-11-11 04:04:20.509 EST] [InitParamHandler.endElement:549]  Percentage of MEM: 40

    [main] [2015-11-11 04:04:20.520 EST] [OsUtilsBase.getTotalPhysicalMemory:411]  Total physical memory in MB: 992

    [main] [2015-11-11 04:04:20.520 EST] [InitParamHandler.endElement:582]  MB of total memory: 396

    [main] [2015-11-11 04:04:20.520 EST] [InitParamHandler.endElement:583]  MB physical memory: 992

    [main] [2015-11-11 04:04:20.521 EST] [OsUtilsBase.is64Bit:395] architecture is 64-bit: true

    [main] [2015-11-11 04:04:20.521 EST] [MemoryCalculator. < clinit >: 103] minimum setting memory for 64-bit

    [main] [2015-11-11 04:04:20.525 EST] [MemoryCalculator.isUnifiedMemoryFeasible:381]  Volume: /.

    [main] [2015-11-11 04:04:20.525 EST] [MemoryCalculator.isUnifiedMemoryFeasible:381]  Volume: / proc

    [main] [2015-11-11 04:04:20.525 EST] [MemoryCalculator.isUnifiedMemoryFeasible:381]  Volume: / sys

    [main] [2015-11-11 04:04:20.525 EST] [MemoryCalculator.isUnifiedMemoryFeasible:381]  Volume: / dev

    [main] [2015-11-11 04:04:20.525 EST] [MemoryCalculator.isUnifiedMemoryFeasible:381]  Volume: / sys/kernel/security

    [main] [2015-11-11 04:04:20.525 EST] [MemoryCalculator.isUnifiedMemoryFeasible:381]  Volume: / dev/shm

    [main] [2015-11-11 04:04:20.526 EST] [MemoryCalculator.isUnifiedMemoryFeasible:388] / dev/shm feasible: true

    [main] [2015-11-11 04:04:20.526 EST] [InitParamHandler.endElement:600] / dev/shm size in MB: 496

    [main] [2015-11-11 04:04:20.526 EST] True bUseUnified [InitParamHandler.endElement:608]

    [main] [2015-11-11 04:04:20.527 EST] [DatafileCloneHandler.startElement:209] atts name CBD

    [main] [2015-11-11 04:04:20.527 EST] Value true length atts [DatafileCloneHandler.startElement:211]

    [main] [2015-11-11 04:04:20.532 EST] [DatabaseStorageAttributes.addRedoLogGroup:331]  This thread doesnot exist in a thread in the group mapping

    [main] [2015-11-11 04:04:20.532 EST] [DatabaseStorageAttributes.addRedoLogGroup:269]  ThreadID = 1 course

    [main] [2015-11-11 04:04:20.532 EST] [DatabaseStorageAttributes.addRedoLogGroup:270] newThread threadID = 1

    [main] [2015-11-11 04:04:20.532 EST] RedoGroups.length [DatabaseStorageAttributes.addRedoLogGroup:303] 1

    [main] [2015-11-11 04:04:20.533 EST] [DatabaseStorageAttributes.addRedoLogGroup:305] new id redoGroup 2

    [main] [2015-11-11 04:04:20.533 EST] RedoGroups [DatabaseStorageAttributes.addRedoLogGroup:310] 1

    [main] [2015-11-11 04:04:20.533 EST] [DatabaseStorageAttributes.addRedoLogGroup:321] arRedoGroups: [1, 2] addition of the thread id 1

    [main] [2015-11-11 04:04:20.534 EST] [DatabaseStorageAttributes.addRedoLogGroup:269]  ThreadID = 1 course

    [main] [2015-11-11 04:04:20.534 EST] [DatabaseStorageAttributes.addRedoLogGroup:270] newThread threadID = 1

    [main] [2015-11-11 04:04:20.534 EST] RedoGroups.length [DatabaseStorageAttributes.addRedoLogGroup:303] 2

    [main] [2015-11-11 04:04:20.534 EST] [DatabaseStorageAttributes.addRedoLogGroup:305] new id redoGroup 3

    [main] [2015-11-11 04:04:20.535 EST] RedoGroups [DatabaseStorageAttributes.addRedoLogGroup:310] 1

    [main] [2015-11-11 04:04:20.535 EST] RedoGroups [DatabaseStorageAttributes.addRedoLogGroup:310] 2

    [main] [2015-11-11 04:04:20.535 EST] [DatabaseStorageAttributes.addRedoLogGroup:321] arRedoGroups: [1, 2, 3] addition of the thread id 1

    [main] [2015-11-11 04:04:20.535 EST] [TemplateManager.getParsedAttributes:1710] is the model a false CBD

    [main] [2015-11-11 04:04:20.536 EST] [Check .getDatabaseSize: 2543]  DataFile Clone: sysaux01.dbf size: 560,0

    [main] [2015-11-11 04:04:20.536 EST] [Check .getDatabaseSize: 2543]  DataFile Clone: system01.dbf size: 780,0

    [main] [2015-11-11 04:04:20.536 EST] [Check .getDatabaseSize: 2543]  DataFile Clone: undotbs01.dbf size: 25.0

    [main] [2015-11-11 04:04:20.536 EST] [Check .getDatabaseSize: 2543]  DataFile Clone: users01.dbf size: 5.0

    [main] [2015-11-11 04:04:20.536 EST] [Check .getControlfFileSizes: 2868]  Control files lol: = 2

    [main] [2015-11-11 04:04:20.536 EST] [Check .getDatabaseSize: 2595] dbSize: redoLogSize 1402880: ctrlFileSize 153600: 40

    [main] [2015-11-11 04:04:20.537 EST] [TemplateManager.getParsedAttributes:1772]  DB_RECOVERY_FILE_SIZE layout to the default size: 4560

    [main] [2015-11-11 04:04:20.537 EST] [TemplateManager.getParsedAttributes:1778]  Real dynamics of FRA

    [main] [2015-11-11 04:04:20.537 EST] [TemplateManager.parseCloneTemplate:1353]  See for portable data files in TemplateManager...

    [main] [2015-11-11 04:04:20.538 EST] SetupOIDCommandlineParameters [Host.setupOIDCommandlineParameters:9418]:

    [main] [2015-11-11 04:04:20.538 EST] M_regWithdirService [Host.setupOIDCommandlineParameters:9419]: false

    [main] [2015-11-11 04:04:20.538 EST] M_unregWithdirService [Host.setupOIDCommandlineParameters:9420]: false

    [main] [2015-11-11 04:04:20.538 EST] M_updateDirService [Host.setupOIDCommandlineParameters:9421]: false

    [main] [2015-11-11 04:04:20.538 EST] SetDataBaseType [Host.startOperation:2789]

    [main] [2015-11-11 04:04:20.538 EST] [Host.startOperation:2872] is false model CBD

    [main] [2015-11-11 04:04:20.539 EST] [TemplateManager.isInstallTemplate:2348]  Selected by the user of the model: = general purpose

    [main] [2015-11-11 04:04:20.539 EST] [TemplateManager.isInstallTemplate:2355]  The Message to search for Id: = GENERAL_PURPOSE

    [main] [2015-11-11 04:04:20.540 EST] [CommonAttributes.replaceVariables:1402] var2/u01/app/oracle

    [main] [2015-11-11 04:04:20.540 EST] [CommonAttributes.replaceVariables:1402] cdb1 var2

    [main] [2015-11-11 04:04:20.541 EST] [Host.startOperation:2990]  Adding user tablesapce for pdb1

    [main] [2015-11-11 04:04:20.543 EST] [PluggableDatabaseUtils.populateDefaultUserTablespaceAttr:1018]  Creating user datafile=/u01/app/oracle/oradata/cdb1/{PDB_NAME}/{PDB_NAME}_users01.dbf

    [main] [2015-11-11 04:04:20.544 EST] [HAUtils.getCurrentOracleHome:593]  Home of the Oracle system property: /u01/app/oracle/product/12.1.0.2/db_1

    [main] [2015-11-11 04:04:20.544 EST] [HAUtils.getConfiguredGridHome:1343] - HOUSE of CRS.

    [main] [2015-11-11 04:04:20.544 EST] [UnixSystem.getCRSHome:2878] olrFileName = /etc/oracle/olr.loc

    [main] [2015-11-11 04:04:20.544 EST] [HAUtils.getHASHome:1500]  Could not get at home.

    PRCI-1144: Impossible to retrieve the path home Oracle Grid Infrastructure

    PRKC-1144: File ' / etc/oracle/olr.loc ' not found.

    [main] [2015-11-11 04:04:20.544 EST] [HADatabaseUtils.isGridMgmtDB:2842]  Mgmt DBName srvm _mgmtdb

    [main] [2015-11-11 04:04:20.545 EST] [Check .processRawConfigFile: 2991]  StorageType == 0

    [main] [2015-11-11 04:04:20.545 EST] [SilentHost.performOperation:458] processRawConfigFile = true

    [main] [2015-11-11 04:04:20.546 EST] [Host.initializeValidationContext:1255] sid, uniquenname, domain defined in validationcontextcdb1 cdb1, cdb1,.

    [main] [2015-11-11 04:04:20.546 EST] [Check .getStorageDataForValidation: 4935]  Enter getStorageDataForValidation

    [main] [2015-11-11 04:04:20.550 EST] [HAUtils.getCurrentOracleHome:593]  Home of the Oracle system property: /u01/app/oracle/product/12.1.0.2/db_1

    [main] [2015-11-11 04:04:20.550 EST] [HAUtils.getConfiguredGridHome:1343] - HOUSE of CRS.

    [main] [2015-11-11 04:04:20.550 EST] [UnixSystem.getCRSHome:2878] olrFileName = /etc/oracle/olr.loc

    [main] [2015-11-11 04:04:20.550 EST] [HAUtils.getHASHome:1500]  Could not get at home.

    PRCI-1144: Impossible to retrieve the path home Oracle Grid Infrastructure

    PRKC-1144: File ' / etc/oracle/olr.loc ' not found.

    [main] [2015-11-11 04:04:20.550 EST] [ASMUtils.initialize:247]  ASMHome: null

    [main] [2015-11-11 04:04:20.556 EST] [KfodUtil.kfodOutput:361] null/rdbms/bin/kfod

    [main] [2015-11-11 04:04:20.556 EST] [KfodUtil.kfodOutput:361] nohdr = TRUE

    [main] [2015-11-11 04:04:20.556 EST] [KfodUtil.kfodOutput:361]  OP = GROUPS

    [main] [2015-11-11 04:04:20.556 EST] Status [KfodUtil.kfodOutput:361] = true

    [main] [2015-11-11 04:04:20.556 EST] [KfodUtil.kfodOutput:361] asmcompatibility = true dbcompatibility = true

    [main] [2015-11-11 04:04:20.557 EST] [KfodUtil.kfodOutput:368]  Can not run the program "null/rdbms/bin/kfod": java.io.IOException: error = 2, no such file or directory

    [main] [2015-11-11 04:04:20.557 EST] [KfodUtil.kfodOutput:369]  Can not run the program "null/rdbms/bin/kfod": java.io.IOException: error = 2, no such file or directory

    java.lang.ProcessBuilder.processException(ProcessBuilder.java:478)

    java.lang.ProcessBuilder.start(ProcessBuilder.java:457)

    java.lang.Runtime.exec(Runtime.java:593)

    java.lang.Runtime.exec(Runtime.java:466)

    oracle.sysman.assistants.util.OsUtilsBase.execProg(OsUtilsBase.java:2300)

    oracle.sysman.assistants.util.OsUtilsBase.execProgNReturnOutput(OsUtilsBase.java:2448)

    oracle.sysman.assistants.util.KfodUtil.kfodOutput(KfodUtil.java:364)

    oracle.sysman.assistants.util.KfodUtil.kfodOutput(KfodUtil.java:254)

    oracle.sysman.assistants.util.KfodUtil.getDiskgroupsWithCompatibilityValues(KfodUtil.java:569)

    oracle.sysman.assistants.util.asm.ASMUtils.loadDiskGroups(ASMUtils.java:1040)

    oracle.sysman.assistants.util.asm.ASMUtils.initialize(ASMUtils.java:277)

    oracle.sysman.assistants.util.asm.ASMUtils.getASMUtils(ASMUtils.java:192)

    oracle.sysman.assistants.dbca.backend.Verifier.initASMDGSpace(Verifier.java:3572)

    oracle.sysman.assistants.dbca.backend.Verifier.initialiseStorageValidationData(Verifier.java:3560)

    oracle.sysman.assistants.dbca.backend.Verifier.getStorageDataForValidation(Verifier.java:4936)

    oracle.sysman.assistants.dbca.backend.Host.initializeValidationContext(Host.java:1402)

    oracle.sysman.assistants.dbca.backend.SilentHost.performOperation(SilentHost.java:460)

    oracle.sysman.assistants.dbca.backend.Host.startOperation(Host.java:3804)

    oracle.sysman.assistants.dbca.Dbca.execute(Dbca.java:153)

    oracle.sysman.assistants.dbca.Dbca.main (Dbca.java:226)

    java.lang.ProcessBuilder.processException(ProcessBuilder.java:478)

    java.lang.ProcessBuilder.start(ProcessBuilder.java:457)

    java.lang.Runtime.exec(Runtime.java:593)

    java.lang.Runtime.exec(Runtime.java:466)

    oracle.sysman.assistants.util.OsUtilsBase.execProg(OsUtilsBase.java:2300)

    oracle.sysman.assistants.util.OsUtilsBase.execProgNReturnOutput(OsUtilsBase.java:2448)

    oracle.sysman.assistants.util.KfodUtil.kfodOutput(KfodUtil.java:364)

    oracle.sysman.assistants.util.KfodUtil.kfodOutput(KfodUtil.java:254)

    oracle.sysman.assistants.util.KfodUtil.getDiskgroupsWithCompatibilityValues(KfodUtil.java:569)

    oracle.sysman.assistants.util.asm.ASMUtils.loadDiskGroups(ASMUtils.java:1040)

    oracle.sysman.assistants.util.asm.ASMUtils.initialize(ASMUtils.java:277)

    oracle.sysman.assistants.util.asm.ASMUtils.getASMUtils(ASMUtils.java:192)

    oracle.sysman.assistants.dbca.backend.Verifier.initASMDGSpace(Verifier.java:3572)

    oracle.sysman.assistants.dbca.backend.Verifier.initialiseStorageValidationData(Verifier.java:3560)

    oracle.sysman.assistants.dbca.backend.Verifier.getStorageDataForValidation(Verifier.java:4936)

    oracle.sysman.assistants.dbca.backend.Host.initializeValidationContext(Host.java:1402)

    oracle.sysman.assistants.dbca.backend.SilentHost.performOperation(SilentHost.java:460)

    oracle.sysman.assistants.dbca.backend.Host.startOperation(Host.java:3804)

    oracle.sysman.assistants.dbca.Dbca.execute(Dbca.java:153)

    oracle.sysman.assistants.dbca.Dbca.main (Dbca.java:226)

    [main] [2015-11-11 04:04:20.558 EST] [KfodUtil.kfodOutput:372]  KFOD null result

    [main] [2015-11-11 04:04:20.558 EST] [Check .initASMDGSpace: 3578] omfLocation = null

    [main] [2015-11-11 04:04:20.558 EST] [Check .initASMDGSpace: 3591]  ControlFile name {ORACLE_BASE} /oradata/ {DB_UNIQUE_NAME} /.

    [main] [2015-11-11 04:04:20.558 EST] [Check .initASMDGSpace: 3591]  ControlFile name {ORACLE_BASE} /fast_recovery_area/ {DB_UNIQUE_NAME} /.

    [main] [2015-11-11 04:04:20.559 EST] [Check .initASMDGSpace: 3612] datafile name {ORACLE_BASE} /oradata/ {DB_UNIQUE_NAME} /.

    [main] [2015-11-11 04:04:20.560 EST] [Check .initASMDGSpace: 3612] datafile name {ORACLE_BASE} /oradata/ {DB_UNIQUE_NAME} /.

    [main] [2015-11-11 04:04:20.560 EST] [Check .initASMDGSpace: 3612] datafile name {ORACLE_BASE} /oradata/ {DB_UNIQUE_NAME} /.

    [main] [2015-11-11 04:04:20.561 EST] [Check .initASMDGSpace: 3612] datafile name {ORACLE_BASE} /oradata/ {DB_UNIQUE_NAME} /.

    [main] [2015-11-11 04:04:20.561 EST] [Check .initASMDGSpace: 3622]  Adding an extra 80 for cancellation of TBS

    [main] [2015-11-11 04:04:20.561 EST] [Check .initASMDGSpace: 3781]  Skip this redolog as its not on ASM

    [main] [2015-11-11 04:04:20.561 EST] [Check .initASMDGSpace: 3781]  Skip this redolog as its not on ASM

    [main] [2015-11-11 04:04:20.561 EST] [Check .initASMDGSpace: 3781]  Skip this redolog as its not on ASM

    [main] [2015-11-11 04:04:20.561 EST] [HADatabaseUtils.isGridMgmtDB:2842]  Mgmt DBName srvm _mgmtdb

    [main] [2015-11-11 04:04:20.562 EST] [Check .initASMDGSpace: 3823]  Passwowd compatible file check for MGMTDB/sidb jump

    [main] [2015-11-11 04:04:20.562 EST] [Check .initASMDGSpace: 3878] dbRecAreaSize0 vertrue {ORACLE_BASE} / fast_recovery_area

    [main] [2015-11-11 04:04:20.562 EST] DbRecAreaSizever4560 [check .initASMDGSpace: 3884]

    [main] [2015-11-11 04:04:20.562 EST] [Check .initASMDGSpace: 3938]  Output getStorageDataForValidation

    [main] [2015-11-11 04:04:20.562 EST] [Check .initFSSpace: 4421] omfLocation = null

    [main] [2015-11-11 04:04:20.563 EST] [Check .initFSSpace: 4442]  Enter newCalculateCloneDatafilePathsAndSizes

    [main] [2015-11-11 04:04:20.563 EST] [CommonAttributes.replaceVariables:1402] var2/u01/app/oracle

    [main] [2015-11-11 04:04:20.563 EST] [CommonAttributes.replaceVariables:1402] cdb1 var2

    [main] [2015-11-11 04:04:20.563 EST] [Check .initFSSpace: 4483] clone /u01/app/oracle/oradata/cdb1/sysaux01.dbf 573440

    [main] [2015-11-11 04:04:20.563 EST] [Check .updateSizeMap: 4905] canonicalPath = / u01/app/oracle/oradata/cdb1 /.

    [main] [2015-11-11 04:04:20.564 EST] [Check .updateSizeMap: 4918]  Addition of the size required for/u01/app/oracle/oradata/cdb1/to 560

    [main] [2015-11-11 04:04:20.564 EST] [CommonAttributes.replaceVariables:1402] var2/u01/app/oracle

    [main] [2015-11-11 04:04:20.564 EST] [CommonAttributes.replaceVariables:1402] cdb1 var2

    [main] [2015-11-11 04:04:20.564 EST] [Check .initFSSpace: 4483] clone /u01/app/oracle/oradata/cdb1/system01.dbf 798720

    [main] [2015-11-11 04:04:20.564 EST] [Check .updateSizeMap: 4905] canonicalPath = / u01/app/oracle/oradata/cdb1 /.

    [main] [2015-11-11 04:04:20.565 EST] [Check .updateSizeMap: 4911]  Update of the size required for/u01/app/oracle/oradata/cdb1/to 1340

    [main] [2015-11-11 04:04:20.565 EST] [CommonAttributes.replaceVariables:1402] var2/u01/app/oracle

    [main] [2015-11-11 04:04:20.565 EST] [CommonAttributes.replaceVariables:1402] cdb1 var2

    [main] [2015-11-11 04:04:20.565 EST] [Check .initFSSpace: 4483] clone /u01/app/oracle/oradata/cdb1/undotbs01.dbf 25600

    [main] [2015-11-11 04:04:20.565 EST] [Check .updateSizeMap: 4905] canonicalPath = / u01/app/oracle/oradata/cdb1 /.

    [main] [2015-11-11 04:04:20.565 EST] [Check .updateSizeMap: 4911]  Update of the size required for/u01/app/oracle/oradata/cdb1/to 1365

    [main] [2015-11-11 04:04:20.566 EST] [CommonAttributes.replaceVariables:1402] var2/u01/app/oracle

    [main] [2015-11-11 04:04:20.566 EST] [CommonAttributes.replaceVariables:1402] cdb1 var2

    [main] [2015-11-11 04:04:20.566 EST] [Check .initFSSpace: 4483] clone /u01/app/oracle/oradata/cdb1/users01.dbf 5120

    [main] [2015-11-11 04:04:20.566 EST] [Check .updateSizeMap: 4905] canonicalPath = / u01/app/oracle/oradata/cdb1 /.

    [main] [2015-11-11 04:04:20.566 EST] [Check .updateSizeMap: 4911]  Update of the size required for/u01/app/oracle/oradata/cdb1/to 1370

    [main] [2015-11-11 04:04:20.566 EST] [CommonAttributes.replaceVariables:1402] var2/u01/app/oracle

    [main] [2015-11-11 04:04:20.567 EST] [CommonAttributes.replaceVariables:1402] cdb1 var2

    [main] [2015-11-11 04:04:20.567 EST] [Check .initFSSpace: 4483] clone /u01/app/oracle/oradata/cdb1/temp01.dbf 61440

    [main] [2015-11-11 04:04:20.567 EST] [Check .updateSizeMap: 4905] canonicalPath = / u01/app/oracle/oradata/cdb1 /.

    [main] [2015-11-11 04:04:20.567 EST] [Check .updateSizeMap: 4911]  Update of the size required for/u01/app/oracle/oradata/cdb1/to 1430

    [main] [2015-11-11 04:04:20.567 EST] [Check .initFSSpace: 4488]  Adding an extra 80 for cancellation of TBS

    [main] [2015-11-11 04:04:20.567 EST] [Check .updateSizeMap: 4923]  Invalid filepath = {ORACLE_BASE} /oradata/ {DB_UNIQUE_NAME} /.

    [main] [2015-11-11 04:04:20.568 EST] [CommonAttributes.replaceVariables:1402] var2/u01/app/oracle

    [main] [2015-11-11 04:04:20.572 EST] [CommonAttributes.replaceVariables:1402] cdb1 var2

    [main] [2015-11-11 04:04:20.572 EST] [Check .initFSSpace: 4659] redo/u01/app/oracle/oradata/cdb1/51200

    [main] [2015-11-11 04:04:20.573 EST] [Check .updateSizeMap: 4905] canonicalPath = / u01/app/oracle/oradata/cdb1 /.

    [main] [2015-11-11 04:04:20.573 EST] [Check .updateSizeMap: 4911]  Update of the size required for/u01/app/oracle/oradata/cdb1/to 1480

    [main] [2015-11-11 04:04:20.573 EST] [CommonAttributes.replaceVariables:1402] var2/u01/app/oracle

    [main] [2015-11-11 04:04:20.573 EST] [CommonAttributes.replaceVariables:1402] cdb1 var2

    [main] [2015-11-11 04:04:20.573 EST] [Check .initFSSpace: 4659] redo/u01/app/oracle/oradata/cdb1/51200

    [main] [2015-11-11 04:04:20.573 EST] [Check .updateSizeMap: 4905] canonicalPath = / u01/app/oracle/oradata/cdb1 /.

    [main] [2015-11-11 04:04:20.573 EST] [Check .updateSizeMap: 4911]  Update of the size required for/u01/app/oracle/oradata/cdb1/to 1530

    [main] [2015-11-11 04:04:20.574 EST] [CommonAttributes.replaceVariables:1402] var2/u01/app/oracle

    [main] [2015-11-11 04:04:20.574 EST] [CommonAttributes.replaceVariables:1402] cdb1 var2

    [main] [2015-11-11 04:04:20.574 EST] [Check .initFSSpace: 4659] redo/u01/app/oracle/oradata/cdb1/51200

    [main] [2015-11-11 04:04:20.574 EST] [Check .updateSizeMap: 4905] canonicalPath = / u01/app/oracle/oradata/cdb1 /.

    [main] [2015-11-11 04:04:20.574 EST] [Check .updateSizeMap: 4911]  Update of the size required for/u01/app/oracle/oradata/cdb1/to 1580

    [main] [2015-11-11 04:04:20.574 EST] [CommonAttributes.replaceVariables:1402] var2/u01/app/oracle

    [main] [2015-11-11 04:04:20.575 EST] [CommonAttributes.replaceVariables:1402] cdb1 var2

    [main] [2015-11-11 04:04:20.575 EST] [Check .initFSSpace: 4691] contrl and buffer/u01/app/oracle/oradata/cdb1/120

    [main] [2015-11-11 04:04:20.575 EST] [Check .updateSizeMap: 4905] canonicalPath = / u01/app/oracle/oradata/cdb1 /.

    [main] [2015-11-11 04:04:20.575 EST] [Check .updateSizeMap: 4911]  Update of the size required for/u01/app/oracle/oradata/cdb1/to 1580

    [main] [2015-11-11 04:04:20.575 EST] [CommonAttributes.replaceVariables:1402] var2/u01/app/oracle

    [main] [2015-11-11 04:04:20.575 EST] [CommonAttributes.replaceVariables:1402] cdb1 var2

    [main] [2015-11-11 04:04:20.575 EST] [Check .initFSSpace: 4691] contrl and buffer/u01/app/oracle/fast_recovery_area/cdb1/120

    [main] [2015-11-11 04:04:20.576 EST] [Check .updateSizeMap: 4905] canonicalPath = / u01/app/oracle/fast_recovery_area/cdb1 /.

    [main] [2015-11-11 04:04:20.576 EST] [Check .updateSizeMap: 4918]  Addition of the size required for/u01/app/oracle/fast_recovery_area/cdb1/0

    [main] [2015-11-11 04:04:20.576 EST] [CommonAttributes.replaceVariables:1402] var2/u01/app/oracle

    [main] [2015-11-11 04:04:20.576 EST] [CommonAttributes.replaceVariables:1402] cdb1 var2

    [main] [2015-11-11 04:04:20.576 EST] [Check .initFSSpace: 4707]  Path of file to default data for CBD = / u01/app/oracle/oradata/cdb1

    [main] [2015-11-11 04:04:20.582 EST] AttributeList.size ([TarUtil.loadMetaDataInfo:452]) 3

    [main] [2015-11-11 04:04:20.583 EST] [Check .initFSSpace: 4726] APB datafile: /oradata/seeddata/pdbseed/system01.dbf size: 250

    [main] [2015-11-11 04:04:20.589 EST] [Check .initFSSpace: 4726] APB datafile: /oradata/seeddata/pdbseed/sysaux01.dbf size: 490

    [main] [2015-11-11 04:04:20.589 EST] [Check .initFSSpace: 4726] APB datafile: /oradata/seeddata/pdbseed/temp01.dbf size: 20

    [main] [2015-11-11 04:04:20.589 EST] [Check .initFSSpace: 4736]  Total size of all data calculated from the pdbseed xml files is: 760

    [main] [2015-11-11 04:04:20.590 EST] [Check .initFSSpace: 4753]  The total size of PDB update for: 1525

    [main] [2015-11-11 04:04:20.590 EST] [CommonAttributes.replaceVariables:1402] var2/u01/app/oracle

    [main] [2015-11-11 04:04:20.590 EST] [Check .initFSSpace: 4828] canonicalPathForFra = / u01/app/oracle/fast_recovery_area /.

    [main] [2015-11-11 04:04:20.590 EST] [Check .initFSSpace: 4859]  Adding path: /u01/app/oracle/oradata/cdb1/sysaux01.dbf for the file existence check

    [main] [2015-11-11 04:04:20.590 EST] [Check .initFSSpace: 4859]  Adding path: /u01/app/oracle/oradata/cdb1/system01.dbf for the file existence check

    [main] [2015-11-11 04:04:20.591 EST] [Check .initFSSpace: 4859]  Adding path: /u01/app/oracle/oradata/cdb1/undotbs01.dbf for the file existence check

    [main] [2015-11-11 04:04:20.591 EST] [Check .initFSSpace: 4859]  Adding path: /u01/app/oracle/oradata/cdb1/users01.dbf for the file existence check

    [main] [2015-11-11 04:04:20.591 EST] [Check .initFSSpace: 4859]  Adding path: /u01/app/oracle/oradata/cdb1/temp01.dbf for the file existence check

    [main] [2015-11-11 04:04:20.591 EST] [Check .initFSSpace: 4862]  Output getStorageDataForValidation

    [main] [2015-11-11 04:04:20.591 EST] [SilentHost.performOperation:461] after initialization to silent mode validation context

    [main] [2015-11-11 04:04:20.648 EST] [ClusterVerification.getInstance:396]  The method entry

    [main] [2015-11-11 04:04:20.653 EST] [ParamManager. < init >: 668] m_paramInstantiated set to TRUE

    [main] [2015-11-11 04:04:20.653 EST] [VerificationUtil.getLocalHost:1312]  Hostname retrieved: ip-172-31-22-120.us-west-2.compute.internal returned: ip-172-31-22-120

    [main] [2015-11-11 04:04:20.654 EST] [Version.isPre:610] version to be checked 12.1.0.2.0 version to check against 10 main

    [main] [2015-11-11 04:04:20.654 EST] IsPre.java [Version.isPre:621]: return FALSE

    [main] [2015-11-11 04:04:20.654 EST] [Version.isPre:610] version to be checked 12.1.0.2.0 version to check against 10 main

    [main] [2015-11-11 04:04:20.655 EST] IsPre.java [Version.isPre:621]: return FALSE

    [main] [2015-11-11 04:04:20.655 EST] [VerificationUtil.isCRSConfigured:4209] crsConfigured = false

    [main] [2015-11-11 04:04:20.655 EST] [Version.isPre:610] version to be checked 12.1.0.2.0 version to check against 10 main

    [main] [2015-11-11 04:04:20.655 EST] IsPre.java [Version.isPre:621]: return FALSE

    [main] [2015-11-11 04:04:20.655 EST] [Version.isPre:610] version to be checked 12.1.0.2.0 version to check against 10 main

    [main] [2015-11-11 04:04:20.655 EST] IsPre.java [Version.isPre:621]: return FALSE

    [main] [2015-11-11 04:04:20.656 EST] [Version.isPre:610] version to be checked 12.1.0.2.0 version to check against 11 main

    [main] [2015-11-11 04:04:20.656 EST] IsPre.java [Version.isPre:621]: return FALSE

    [main] [2015-11-11 04:04:20.656 EST] [Version.isPre:642] version to be checked 12.1.0.2.0 version to check against 11 minor version to check against 2 main

    [main] [2015-11-11 04:04:20.656 EST] [Version.isPre:651] isPre: return FALSE for major version control

    [main] [2015-11-11 04:04:20.656 EST] [UnixSystem.isHAConfigured:2788] olrFileName = /etc/oracle/olr.loc

    [main] [2015-11-11 04:04:20.656 EST] [VerificationUtil.isHAConfigured:4181] haConfigured = false

    [main] [2015-11-11 04:04:20.674 EST] [Check .validateMemory: 1219]  Audit exception: the default location for home is not available. It must be specified

    [main] [2015-11-11 04:04:20.674 EST] [ClusterVerification.getInstance:396]  The method entry

    [main] [2015-11-11 04:04:20.675 EST] [VerificationUtil.getLocalHost:1312]  Hostname retrieved: ip-172-31-22-120.us-west-2.compute.internal returned: ip-172-31-22-120

    [main] [2015-11-11 04:04:20.675 EST] [Version.isPre:610] version to be checked 12.1.0.2.0 version to check against 10 main

    [main] [2015-11-11 04:04:20.675 EST] IsPre.java [Version.isPre:621]: return FALSE

    [main] [2015-11-11 04:04:20.675 EST] [Version.isPre:610] version to be checked 12.1.0.2.0 version to check against 10 main

    [main] [2015-11-11 04:04:20.675 EST] IsPre.java [Version.isPre:621]: return FALSE

    [main] [2015-11-11 04:04:20.675 EST] [VerificationUtil.isCRSConfigured:4209] crsConfigured = false

    [main] [2015-11-11 04:04:20.676 EST] [Version.isPre:610] version to be checked 12.1.0.2.0 version to check against 10 main

    [main] [2015-11-11 04:04:20.676 EST] IsPre.java [Version.isPre:621]: return FALSE

    [main] [2015-11-11 04:04:20.676 EST] [Version.isPre:610] version to be checked 12.1.0.2.0 version to check against 10 main

    [main] [2015-11-11 04:04:20.676 EST] IsPre.java [Version.isPre:621]: return FALSE

    [main] [2015-11-11 04:04:20.676 EST] [Version.isPre:610] version to be checked 12.1.0.2.0 version to check against 11 main

    [main] [2015-11-11 04:04:20.676 EST] IsPre.java [Version.isPre:621]: return FALSE

    [main] [2015-11-11 04:04:20.677 EST] [Version.isPre:642] version to be checked 12.1.0.2.0 version to check against 11 minor version to check against 2 main

    [main] [2015-11-11 04:04:20.677 EST] [Version.isPre:651] isPre: return FALSE for major version control

    [main] [2015-11-11 04:04:20.677 EST] [UnixSystem.isHAConfigured:2788] olrFileName = /etc/oracle/olr.loc

    [main] [2015-11-11 04:04:20.677 EST] [VerificationUtil.isHAConfigured:4181] haConfigured = false

    [main] [2015-11-11 04:04:20.677 EST] [Check .validateSGA: 1248]  Audit exception: the default location for home is not available. It must be specified

    [main] [2015-11-11 04:04:20.677 EST] True checkUnified [check .validateSharedPoolSize: 1273]

    [main] [2015-11-11 04:04:20.678 EST] [Check .validateSharedPoolSize: 1274] checkUnified 415236096

    [main] [2015-11-11 04:04:20.678 EST] [HAUtils.getCurrentOracleHome:593]  Home of the Oracle system property: /u01/app/oracle/product/12.1.0.2/db_1

    [main] [2015-11-11 04:04:20.678 EST] [HAUtils.getConfiguredGridHome:1343] - HOUSE of CRS.

    [main] [2015-11-11 04:04:20.678 EST] [UnixSystem.getCRSHome:2878] olrFileName = /etc/oracle/olr.loc

    [main] [2015-11-11 04:04:20.678 EST] [HAUtils.getHASHome:1500]  Could not get at home.

    PRCI-1144: Impossible to retrieve the path home Oracle Grid Infrastructure

    PRKC-1144: File ' / etc/oracle/olr.loc ' not found.

    [main] [2015-11-11 04:04:20.679 EST] Call validatebackend [Host.validate:5345]

    [main] [2015-11-11 04:04:20.679 EST] ValidateBackend departure [check .validateBackend: 1026]

    [main] [2015-11-11 04:04:20.680 EST] [DBCAValidator.loadCreateDBValidationGroups:400] run TR db validations

    [main] [2015-11-11 04:04:20.681 EST] [Host.noEntryinOratab:7194]  Check for oratab arg passed...

    [main] [2015-11-11 04:04:20.681 EST] [DBCAValidator.loadCreateDBValidationGroups:403] jump dbid validatoin for if

    [main] [2015-11-11 04:04:20.681 EST] False isCluster [DBCAValidator.loadCreateDBValidationGroups:415]

    [main] [2015-11-11 04:04:20.681 EST] False isHARegnReq [DBCAValidator.loadCreateDBValidationGroups:416]

    [main] [2015-11-11 04:04:20.685 EST] Iscdb1 gdbname [DBIdentificationHelper.getDbNameError:224]

    [main] [2015-11-11 04:04:20.711 EST] [Check .validateBackend: 1033]  The result of the validation:

    Checking database unique identifier passed.

    [main] [2015-11-11 04:04:20.711 EST] [Check .validateBackend: 1058] writing true trace result

    [main] [2015-11-11 04:04:20.713 EST] [StorageSpaceCheck.validate:97]  Get volumes of spatial maps 3, 1

    [main] [2015-11-11 04:04:20.713 EST] [StorageSpaceCheck.getConsolidatedMap:312] locationString processed: / u01/app/oracle/oradata/cdb1 original String: / u01/app/oracle/oradata/cdb1 /.

    [main] [2015-11-11 04:04:20.713 EST] [HAUtils.getCurrentOracleHome:593]  Home of the Oracle system property: /u01/app/oracle/product/12.1.0.2/db_1

    [main] [2015-11-11 04:04:20.713 EST] [HAUtils.getConfiguredGridHome:1343] - HOUSE of CRS.

    [main] [2015-11-11 04:04:20.713 EST] [UnixSystem.getCRSHome:2878] olrFileName = /etc/oracle/olr.loc

    [main] [2015-11-11 04:04:20.714 EST] [HAUtils.getHASHome:1500]  Could not get at home.

    PRCI-1144: Impossible to retrieve the path home Oracle Grid Infrastructure

    PRKC-1144: File ' / etc/oracle/olr.loc ' not found.

    [main] [2015-11-11 04:04:20.714 EST] IsPathOnACFS [HAUtils.isPathOnACFS:3995]: false

    [main] [2015-11-11 04:04:20.832 EST] [OsUtilsBase.getMountPoint:2822] mount point to be checked/sys/kernel/security /.

    [main] [2015-11-11 04:04:20.833 EST] [OsUtilsBase.getMountPoint:2822] mount point to be checked/sys/kernel/debug /.

    [main] [2015-11-11 04:04:20.833 EST] [OsUtilsBase.getMountPoint:2822] mount point to be checked/sys/kernel/config /.

    [main] [2015-11-11 04:04:20.834 EST] [OsUtilsBase.getMountPoint:2822] mount point to be checked/sys/fs/selinux /.

    [main] [2015-11-11 04:04:20.835 EST] [OsUtilsBase.getMountPoint:2822] mount point to be checked/sys/fs/pstore.

    [main] [2015-11-11 04:04:20.835 EST] [OsUtilsBase.getMountPoint:2822] mount point to be checked/sys/fs/cgroup/systemd.

    [main] [2015-11-11 04:04:20.835 EST] [OsUtilsBase.getMountPoint:2822] mount point to be checked/sys/fs/cgroup/perf_event.

    [main] [2015-11-11 04:04:20.835 EST] [OsUtilsBase.getMountPoint:2822] mount point to be checked/sys/fs/cgroup/net_cls /.

    [main] [2015-11-11 04:04:20.835 EST] [OsUtilsBase.getMountPoint:2822] mount point to be checked/sys/fs/cgroup/memory.

    [main] [2015-11-11 04:04:20.835 EST] [OsUtilsBase.getMountPoint:2822] mount point to be checked/sys/fs/cgroup/hugetlb.

    [main] [2015-11-11 04:04:20.836 EST] [OsUtilsBase.getMountPoint:2822] mount point to be checked/sys/fs/cgroup/freezer.

    [main] [2015-11-11 04:04:20.836 EST] [OsUtilsBase.getMountPoint:2822] mount point to be checked/sys/fs/cgroup/devices /.

    [main] [2015-11-11 04:04:20.836 EST] [OsUtilsBase.getMountPoint:2822] mount point to be checked/sys/fs/cgroup/cpuset.

    [main] [2015-11-11 04:04:20.836 EST] [OsUtilsBase.getMountPoint:2822] mount point to be checked/sys/fs/cgroup/cpu, cpuacct.

    [main] [2015-11-11 04:04:20.836 EST] [OsUtilsBase.getMountPoint:2822] mount point to be checked/sys/fs/cgroup/blkio /.

    [main] [2015-11-11 04:04:20.836 EST] [OsUtilsBase.getMountPoint:2822] mount point to be checked/sys/fs/cgroup /.

    [main] [2015-11-11 04:04:20.836 EST] [OsUtilsBase.getMountPoint:2822] mount point to be checked /sys/

    [main] [2015-11-11 04:04:20.837 EST] [OsUtilsBase.getMountPoint:2822] mount point to be checked /run/

    [main] [2015-11-11 04:04:20.837 EST] [OsUtilsBase.getMountPoint:2822] mount point to be checked/proc/sys/fs/binfmt_misc /.

    [main] [2015-11-11 04:04:20.837 EST] [OsUtilsBase.getMountPoint:2822] mount point to be checked/proc/sys/fs/binfmt_misc /.

    [main] [2015-11-11 04:04:20.837 EST] [OsUtilsBase.getMountPoint:2822] mount point to be checked/proc /.

    [main] [2015-11-11 04:04:20.837 EST] [OsUtilsBase.getMountPoint:2822] mount point to be checked/dev/shm /.

    [main] [2015-11-11 04:04:20.837 EST] [OsUtilsBase.getMountPoint:2822] mount point to be checked/dev/pts /.

    [main] [2015-11-11 04:04:20.837 EST] [OsUtilsBase.getMountPoint:2822] mount point to be checked/dev/mqueue /.

    [main] [2015-11-11 04:04:20.838 EST] [OsUtilsBase.getMountPoint:2822] mount point to be checked/dev/hugepages.

    [main] [2015-11-11 04:04:20.838 EST] [OsUtilsBase.getMountPoint:2822] mount point to be checked/dev /.

    [main] [2015-11-11 04:04:20.838 EST] [OsUtilsBase.getMountPoint:2822] mount at check point.

    [main] [2015-11-11 04:04:20.838 EST] [StorageSpaceCheck.getConsolidatedMap:341]  Point/u01/app/oracle/oradata/cdb1 of editing/is /.

    [main] [2015-11-11 04:04:20.838 EST] [StorageSpaceCheck.getConsolidatedMap:312] locationString processed: / u01/app/oracle/oradata/cdb1 original String: / u01/app/oracle/oradata/cdb1

    [main] [2015-11-11 04:04:20.838 EST] [HAUtils.getCurrentOracleHome:593]  Home of the Oracle system property: /u01/app/oracle/product/12.1.0.2/db_1

    [main] [2015-11-11 04:04:20.838 EST] [HAUtils.getConfiguredGridHome:1343] - HOUSE of CRS.

    [main] [2015-11-11 04:04:20.839 EST] [UnixSystem.getCRSHome:2878] olrFileName = /etc/oracle/olr.loc

    [main] [2015-11-11 04:04:20.839 EST] [HAUtils.getHASHome:1500]  Could not get at home.

    PRCI-1144: Impossible to retrieve the path home Oracle Grid Infrastructure

    PRKC-1144: File ' / etc/oracle/olr.loc ' not found.

    [main] [2015-11-11 04:04:20.839 EST] IsPathOnACFS [HAUtils.isPathOnACFS:3995]: false

    [main] [2015-11-11 04:04:20.853 EST] [OsUtilsBase.getMountPoint:2822] mount point to be checked/sys/kernel/security /.

    [main] [2015-11-11 04:04:20.853 EST] [OsUtilsBase.getMountPoint:2822] mount point to be checked/sys/kernel/debug /.

    [main] [2015-11-11 04:04:20.853 EST] [OsUtilsBase.getMountPoint:2822] mount point to be checked/sys/kernel/config /.

    [main] [2015-11-11 04:04:20.853 EST] [OsUtilsBase.getMountPoint:2822] mount point to be checked/sys/fs/selinux /.

    [main] [2015-11-11 04:04:20.853 EST] [OsUtilsBase.getMountPoint:2822] mount point to be checked/sys/fs/pstore.

    [main] [2015-11-11 04:04:20.853 EST] [OsUtilsBase.getMountPoint:2822] mount point to be checked/sys/fs/cgroup/systemd.

    [main] [2015-11-11 04:04:20.853 EST] [OsUtilsBase.getMountPoint:2822] mount point to be checked/sys/fs/cgroup/perf_event.

    [main] [2015-11-11 04:04:20.854 EST] [OsUtilsBase.getMountPoint:2822] mount point to be checked/sys/fs/cgroup/net_cls /.

    [main] [2015-11-11 04:04:20.854 EST] [OsUtilsBase.getMountPoint:2822] mount point to be checked/sys/fs/cgroup/memory.

    [main] [2015-11-11 04:04:20.854 EST] [OsUtilsBase.getMountPoint:2822] mount point to be checked/sys/fs/cgroup/hugetlb.

    [main] [2015-11-11 04:04:20.854 EST] [OsUtilsBase.getMountPoint:2822] mount point to be checked/sys/fs/cgroup/freezer.

    [main] [2015-11-11 04:04:20.854 EST] [OsUtilsBase.getMountPoint:2822] mount point to be checked/sys/fs/cgroup/devices /.

    [main] [2015-11-11 04:04:20.854 EST] [OsUtilsBase.getMountPoint:2822] mount point to be checked/sys/fs/cgroup/cpuset.

    [main] [2015-11-11 04:04:20.855 EST] [OsUtilsBase.getMountPoint:2822] mount point to be checked/sys/fs/cgroup/cpu, cpuacct.

    [main] [2015-11-11 04:04:20.855 EST] [OsUtilsBase.getMountPoint:2822] mount point to be checked/sys/fs/cgroup/blkio /.

    [main] [2015-11-11 04:04:20.855 EST] [OsUtilsBase.getMountPoint:2822] mount point to be checked/sys/fs/cgroup /.

    [main] [2015-11-11 04:04:20.855 EST] [OsUtilsBase.getMountPoint:2822] mount point to be checked /sys/

    [main] [2015-11-11 04:04:20.855 EST] [OsUtilsBase.getMountPoint:2822] mount point to be checked /run/

    [main] [2015-11-11 04:04:20.855 EST] [OsUtilsBase.getMountPoint:2822] mount point to be checked/proc/sys/fs/binfmt_misc /.

    [main] [2015-11-11 04:04:20.855 EST] [OsUtilsBase.getMountPoint:2822] mount point to be checked/proc/sys/fs/binfmt_misc /.

    [main] [2015-11-11 04:04:20.855 EST] [OsUtilsBase.getMountPoint:2822] mount point to be checked/proc /.

    [main] [2015-11-11 04:04:20.856 EST] [OsUtilsBase.getMountPoint:2822] mount point to be checked/dev/shm /.

    [main] [2015-11-11 04:04:20.856 EST] [OsUtilsBase.getMountPoint:2822] mount point to be checked/dev/pts /.

    [main] [2015-11-11 04:04:20.856 EST] [OsUtilsBase.getMountPoint:2822] mount point to be checked/dev/mqueue /.

    [main] [2015-11-11 04:04:20.856 EST] [OsUtilsBase.getMountPoint:2822] mount point to be checked/dev/hugepages.

    [main] [2015-11-11 04:04:20.856 EST] [OsUtilsBase.getMountPoint:2822] mount point to be checked/dev /.

    [main] [2015-11-11 04:04:20.856 EST] [OsUtilsBase.getMountPoint:2822] mount at check point.

    [main] [2015-11-11 04:04:20.856 EST] [StorageSpaceCheck.getConsolidatedMap:341]  / U01/app/oracle/oradata/cdb1 mount point is /.

    [main] [2015-11-11 04:04:20.857 EST] [StorageSpaceCheck.getConsolidatedMap:312] locationString processed: / u01/app/oracle/fast_recovery_area/cdb1 original String: / u01/app/oracle/fast_recovery_area/cdb1 /.

    [main] [2015-11-11 04:04:20.857 EST] [HAUtils.getCurrentOracleHome:593]  Home of the Oracle system property: /u01/app/oracle/product/12.1.0.2/db_1

    [main] [2015-11-11 04:04:20.857 EST] [HAUtils.getConfiguredGridHome:1343] - HOUSE of CRS.

    [main] [2015-11-11 04:04:20.857 EST] [UnixSystem.getCRSHome:2878] olrFileName = /etc/oracle/olr.loc

    [main] [2015-11-11 04:04:20.857 EST] [HAUtils.getHASHome:1500]  Could not get at home.

    PRCI-1144: Impossible to retrieve the path home Oracle Grid Infrastructure

    PRKC-1144: File ' / etc/oracle/olr.loc ' not found.

    [main] [2015-11-11 04:04:20.858 EST] IsPathOnACFS [HAUtils.isPathOnACFS:3995]: false

    [main] [2015-11-11 04:04:20.863 EST] [OsUtilsBase.getMountPoint:2822] mount point to be checked/sys/kernel/security /.

    [main] [2015-11-11 04:04:20.863 EST] [OsUtilsBase.getMountPoint:2822] mount point to be checked/sys/kernel/debug /.

    [main] [2015-11-11 04:04:20.864 EST] [OsUtilsBase.getMountPoint:2822] mount point to be checked/sys/kernel/config /.

    [main] [2015-11-11 04:04:20.864 EST] [OsUtilsBase.getMountPoint:2822] mount point to be checked/sys/fs/selinux /.

    [main] [2015-11-11 04:04:20.864 EST] [OsUtilsBase.getMountPoint:2822] mount point to be checked/sys/fs/pstore.

    [main] [2015-11-11 04:04:20.864 EST] [OsUtilsBase.getMountPoint:2822] mount point to be checked/sys/fs/cgroup/systemd.

    [main] [2015-11-11 04:04:20.864 EST] [OsUtilsBase.getMountPoint:2822] mount point to be checked/sys/fs/cgroup/perf_event.

    [main] [2015-11-11 04:04:20.864 EST] [OsUtilsBase.getMountPoint:2822] mount point to be checked/sys/fs/cgroup/net_cls /.

    [main] [2015-11-11 04:04:20.864 EST] [OsUtilsBase.getMountPoint:2822] mount point to be checked/sys/fs/cgroup/memory.

    [main] [2015-11-11 04:04:20.865 EST] [OsUtilsBase.getMountPoint:2822] mount point to be checked/sys/fs/cgroup/hugetlb.

    [main] [2015-11-11 04:04:20.865 EST] [OsUtilsBase.getMountPoint:2822] mount point to be checked/sys/fs/cgroup/freezer.

    [main] [2015-11-11 04:04:20.865 EST] [OsUtilsBase.getMountPoint:2822] mount point to be checked/sys/fs/cgroup/devices /.

    [main] [2015-11-11 04:04:20.865 EST] [OsUtilsBase.getMountPoint:2822] mount point to be checked/sys/fs/cgroup/cpuset.

    [main] [2015-11-11 04:04:20.865 EST] [OsUtilsBase.getMountPoint:2822] mount point to be checked/sys/fs/cgroup/cpu, cpuacct.

    [main] [2015-11-11 04:04:20.865 EST] [OsUtilsBase.getMountPoint:2822] mount point to be checked/sys/fs/cgroup/blkio /.

    [main] [2015-11-11 04:04:20.865 EST] [OsUtilsBase.getMountPoint:2822] mount point to be checked/sys/fs/cgroup /.

    [main] [2015-11-11 04:04:20.866 EST] [OsUtilsBase.getMountPoint:2822] mount point to be checked /sys/

    [main] [2015-11-11 04:04:20.866 EST] [OsUtilsBase.getMountPoint:2822] mount point to be checked /run/

    [main] [2015-11-11 04:04:20.866 EST] [OsUtilsBase.getMountPoint:2822] mount point to be checked/proc/sys/fs/binfmt_misc /.

    [main] [2015-11-11 04:04:20.866 EST] [OsUtilsBase.getMountPoint:2822] mount point to be checked/proc/sys/fs/binfmt_misc /.

    [main] [2015-11-11 04:04:20.866 EST] [OsUtilsBase.getMountPoint:2822] mount point to be checked/proc /.

    [main] [2015-11-11 04:04:20.866 EST] [OsUtilsBase.getMountPoint:2822] mount point to be checked/dev/shm /.

    [main] [2015-11-11 04:04:20.867 EST] [OsUtilsBase.getMountPoint:2822] mount point to be checked/dev/pts /.

    [main] [2015-11-11 04:04:20.867 EST] [OsUtilsBase.getMountPoint:2822] mount point to be checked/dev/mqueue /.

    [main] [2015-11-11 04:04:20.867 EST] [OsUtilsBase.getMountPoint:2822] mount point to be checked/dev/hugepages.

    [main] [2015-11-11 04:04:20.867 EST] [OsUtilsBase.getMountPoint:2822] mount point to be checked/dev /.

    [main] [2015-11-11 04:04:20.867 EST] [OsUtilsBase.getMountPoint:2822] mount at check point.

    [main] [2015-11-11 04:04:20.867 EST] [StorageSpaceCheck.getConsolidatedMap:341]  Point/u01/app/oracle/fast_recovery_area/cdb1 of editing/is /.

    [main] [2015-11-11 04:04:20.867 EST] [StorageSpaceCheck.getConsolidatedMap:312] locationString processed: / u01/app/oracle/fast_recovery_area original String: / u01/app/oracle/fast_recovery_area

    [main] [2015-11-11 04:04:20.868 EST] [HAUtils.getCurrentOracleHome:593]  Home of the Oracle system property: /u01/app/oracle/product/12.1.0.2/db_1

    [main] [2015-11-11 04:04:20.868 EST] [HAUtils.getConfiguredGridHome:1343] - HOUSE of CRS.

    [main] [2015-11-11 04:04:20.868 EST] [UnixSystem.getCRSHome:2878] olrFileName = /etc/oracle/olr.loc

    [main] [2015-11-11 04:04:20.868 EST] [HAUtils.getHASHome:1500]  Could not get at home.

    PRCI-1144: Impossible to retrieve the path home Oracle Grid Infrastructure

    PRKC-1144: File ' / etc/oracle/olr.loc ' not found.

    [main] [2015-11-11 04:04:20.868 EST] IsPathOnACFS [HAUtils.isPathOnACFS:3995]: false

    [main] [2015-11-11 04:04:20.872 EST] [OsUtilsBase.getMountPoint:2822] mount point to be checked/sys/kernel/security /.

    [main] [2015-11-11 04:04:20.872 EST] [OsUtilsBase.getMountPoint:2822] mount point to be checked/sys/kernel/debug /.

    [main] [2015-11-11 04:04:20.872 EST] [OsUtilsBase.getMountPoint:2822] mount point to be checked/sys/kernel/config /.

    [main] [2015-11-11 04:04:20.872 EST] [OsUtilsBase.getMountPoint:2822] mount point to be checked/sys/fs/selinux /.

    [main] [2015-11-11 04:04:20.872 EST] [OsUtilsBase.getMountPoint:2822] mount point to be checked/sys/fs/pstore.

    [main] [2015-11-11 04:04:20.872 EST] [OsUtilsBase.getMountPoint:2822] mount point to be checked/sys/fs/cgroup/systemd.

    [main] [2015-11-11 04:04:20.873 EST] [OsUtilsBase.getMountPoint:2822] mount point to be checked/sys/fs/cgroup/perf_event.

    [main] [2015-11-11 04:04:20.873 EST] [OsUtilsBase.getMountPoint:2822] mount point to be checked/sys/fs/cgroup/net_cls /.

    [main] [2015-11-11 04:04:20.873 EST] [OsUtilsBase.getMountPoint:2822] mount point to be checked/sys/fs/cgroup/memory.

    [main] [2015-11-11 04:04:20.873 EST] [OsUtilsBase.getMountPoint:2822] mount point to be checked/sys/fs/cgroup/hugetlb.

    [main] [2015-11-11 04:04:20.873 EST] [OsUtilsBase.getMountPoint:2822] mount point to be checked/sys/fs/cgroup/freezer.

    [main] [2015-11-11 04:04:20.873 EST] [OsUtilsBase.getMountPoint:2822] mount point to be checked/sys/fs/cgroup/devices /.

    [main] [2015-11-11 04:04:20.873 EST] [OsUtilsBase.getMountPoint:2822] mount point to be checked/sys/fs/cgroup/cpuset.

    [main] [2015-11-11 04:04:20.874 EST] [OsUtilsBase.getMountPoint:2822] mount point to be checked/sys/fs/cgroup/cpu, cpuacct.

    [main] [2015-11-11 04:04:20.874 EST] [OsUtilsBase.getMountPoint:2822] mount point to be checked/sys/fs/cgroup/blkio /.

    [main] [2015-11-11 04:04:20.874 EST] [OsUtilsBase.getMountPoint:2822] mount point to be checked/sys/fs/cgroup /.

    [main] [2015-11-11 04:04:20.874 EST] [OsUtilsBase.getMountPoint:2822] mount point to be checked /sys/

    [main] [2015-11-11 04:04:20.874 EST] [OsUtilsBase.getMountPoint:2822] mount point to be checked /run/

    [main] [2015-11-11 04:04:20.874 EST] [OsUtilsBase.getMountPoint:2822] mount point to be checked/proc/sys/fs/binfmt_misc /.

    [main] [2015-11-11 04:04:20.874 EST] [OsUtilsBase.getMountPoint:2822] mount point to be checked/proc/sys/fs/binfmt_misc /.

    [main] [2015-11-11 04:04:20.875 EST] [OsUtilsBase.getMountPoint:2822] mount point to be checked/proc /.

    [main] [2015-11-11 04:04:20.875 EST] [OsUtilsBase.getMountPoint:2822] mount point to be checked/dev/shm /.

    [main] [2015-11-11 04:04:20.875 EST] [OsUtilsBase.getMountPoint:2822] mount point to be checked/dev/pts /.

    [main] [2015-11-11 04:04:20.875 EST] [OsUtilsBase.getMountPoint:2822] mount point to be checked/dev/mqueue /.

    [main] [2015-11-11 04:04:20.875 EST] [OsUtilsBase.getMountPoint:2822] mount point to be checked/dev/hugepages.

    [main] [2015-11-11 04:04:20.875 EST] [OsUtilsBase.getMountPoint:2822] mount point to be checked/dev /.

    [main] [2015-11-11 04:04:20.875 EST] [OsUtilsBase.getMountPoint:2822] mount at check point.

    [main] [2015-11-11 04:04:20.876 EST] [StorageSpaceCheck.getConsolidatedMap:341]  / U01/app/oracle/fast_recovery_area mount point is /.

    [main] [2015-11-11 04:04:20.876 EST] [StorageSpaceCheck.validate:136]  Archive storage.

    [main] [2015-11-11 04:04:20.876 EST] [HAUtils.getCurrentOracleHome:593]  Home of the Oracle system property: /u01/app/oracle/product/12.1.0.2/db_1

    [main] [2015-11-11 04:04:20.876 EST] [HAUtils.getConfiguredGridHome:1343] - HOUSE of CRS.

    [main] [2015-11-11 04:04:20.876 EST] [UnixSystem.getCRSHome:2878] olrFileName = /etc/oracle/olr.loc

    [main] [2015-11-11 04:04:20.877 EST] [HAUtils.getHASHome:1500]  Could not get at home.

    PRCI-1144: Impossible to retrieve the path home Oracle Grid Infrastructure

    PRKC-1144: File ' / etc/oracle/olr.loc ' not found.

    [main] [2015-11-11 04:04:20.877 EST] IsPathOnACFS [HAUtils.isPathOnACFS:3995]: false

    [main] [2015-11-11 04:04:20.877 EST] [StorageSpaceCheck.validate:165] / isACFSMountPoint: false

    [main] [2015-11-11 04:04:20.877 EST] [StorageSpaceCheck.parseSpaceResult:385] real: 17768 location: / mandatorySpace: optionalSpace 3105: 4560

    [main] [2015-11-11 04:04:20.879 EST] [Check .validateBackend: 1033]  The result of the validation:

    / has enough space. Space required is 7665 MB, available space is 17768 MB.

    File of successful Validations.

    [main] [2015-11-11 04:04:20.879 EST] [Check .validateBackend: 1058] writing true trace result

    [main] [2015-11-11 04:04:20.879 EST] [CommonAttributes.replaceVariables:1402] /u01/app/oracle/product/12.1.0.2/db_1 var2

    [main] [2015-11-11 04:04:20.879 EST] [CommonAttributes.replaceVariables:1402] /u01/app/oracle/product/12.1.0.2/db_1 var2

    [main] [2015-11-11 04:04:20.879 EST] [Host.checkCloneJarExists:5160] /U01/app/oracle/product/12.1.0.2/db_1/assistants/dbca/templates/Seed_Database.dfb backup piece is

    [main] [2015-11-11 04:04:20.880 EST] [Host.executeSteps:5975]  Stages of execution...

    [main] [2015-11-11 04:04:20.880 EST] [HADatabaseUtils.isGridMgmtDB:2842]  Mgmt DBName srvm _mgmtdb

    [main] [2015-11-11 04:04:20.880 EST] SetUpForOperation [Host.setUpForOperation:4003]: Mode = 128

    [main] [2015-11-11 04:04:20.880 EST] [OsUtilsBase.copyFile:1505]  OsUtilsBase.copyFile:

    [main] [2015-11-11 04:04:20.882 EST] [CommonAttributes.replaceVariables:1402] var2/u01/app/oracle

    [main] [2015-11-11 04:04:20.882 EST] [CommonAttributes.replaceVariables:1402] cdb1 var2

    [main] [2015-11-11 04:04:20.882 EST] [CommonAttributes.replaceVariables:1402] var2/u01/app/oracle

    [main] [2015-11-11 04:04:20.882 EST] [CommonAttributes.replaceVariables:1402] cdb1 var2

    [main] [2015-11-11 04:04:20.882 EST] [Host.getAuditNextGen:9054] / U01/app/oracle/audit audit of NextGen

    [main] [2015-11-11 04:04:20.883 EST] [CommonAttributes.replaceVariables:1402] var2/u01/app/oracle

    [main] [2015-11-11 04:04:20.883 EST] [CommonAttributes.replaceVariables:1402] var2/u01/app/oracle

    [main] [2015-11-11 04:04:20.883 EST] [Host.getFolders:10740] add path to DB_RECOVERY_FILE_DETS/u01/app/oracle/fast_recovery_area

    [main] [2015-11-11 04:04:20.883 EST] [Host.getFolders:10750]  RedoLogDestName db_create_online_log_dest_1

    [main] [2015-11-11 04:04:20.883 EST] [Host.getFolders:10750]  RedoLogDestName db_create_online_log_dest_2

    [main] [2015-11-11 04:04:20.883 EST] [Host.getFolders:10750]  RedoLogDestName db_create_online_log_dest_3

    [main] [2015-11-11 04:04:20.884 EST] [Host.getFolders:10750]  RedoLogDestName db_create_online_log_dest_4

    [main] [2015-11-11 04:04:20.884 EST] [Host.getFolders:10750]  RedoLogDestName db_create_online_log_dest_5

    [main] [2015-11-11 04:04:20.884 EST] [CommonAttributes.replaceVariables:1402] /u01/app/oracle/product/12.1.0.2/db_1 var2

    [main] [2015-11-11 04:04:20.884 EST] [CommonAttributes.replaceVariables:1402] cdb1 var2

    [main] [2015-11-11 04:04:20.884 EST] [CommonAttributes.replaceVariables:1402] /u01/app/oracle/product/12.1.0.2/db_1 var2

    [main] [2015-11-11 04:04:20.884 EST] [CommonAttributes.replaceVariables:1402] cdb1 var2

    [main] [2015-11-11 04:04:20.884 EST] [Host.getFolders:10786] add path to /u01/app/oracle/product/12.1.0.2/db_1/dbs

    [main] [2015-11-11 04:04:20.885 EST] [CommonAttributes.replaceVariables:1402] var2/u01/app/oracle

    [main] [2015-11-11 04:04:20.885 EST] [CommonAttributes.replaceVariables:1402] cdb1 var2

    [main] [2015-11-11 04:04:20.885 EST] [Host.getFolders:10838] add path/u01/app/oracle/oradata/cdb1

    [main] [2015-11-11 04:04:20.885 EST] [Host.getFolders:10841] m_enableDBConsolidation: true

    [main] [2015-11-11 04:04:20.885 EST] [InitParamAttributes.needPdbSeedConvert:5220]  OMF Mode: false usePdbFileNameConvert: false

    [main] [2015-11-11 04:04:20.886 EST] [Host.getFolders:10849] add path/u01/app/oracle/oradata/cdb1/pdbseed

    [main] [2015-11-11 04:04:20.886 EST] [CommonAttributes.replaceVariables:1402] var2/u01/app/oracle

    [main] [2015-11-11 04:04:20.886 EST] [CommonAttributes.replaceVariables:1402] cdb1 var2

    [main] [2015-11-11 04:04:20.886 EST] [Host.getFolders:10841] m_enableDBConsolidation: true

    [main] [2015-11-11 04:04:20.886 EST] [InitParamAttributes.needPdbSeedConvert:5220]  OMF Mode: false usePdbFileNameConvert: false

    [main] [2015-11-11 04:04:20.886 EST] [CommonAttributes.replaceVariables:1402] var2/u01/app/oracle

    [main] [2015-11-11 04:04:20.886 EST] [CommonAttributes.replaceVariables:1402] cdb1 var2

    [main] [2015-11-11 04:04:20.887 EST] [Host.getFolders:10841] m_enableDBConsolidation: true

    [main] [2015-11-11 04:04:20.887 EST] [InitParamAttributes.needPdbSeedConvert:5220]  OMF Mode: false usePdbFileNameConvert: false

    [main] [2015-11-11 04:04:20.887 EST] [CommonAttributes.replaceVariables:1402] var2/u01/app/oracle

    [main] [2015-11-11 04:04:20.887 EST] [CommonAttributes.replaceVariables:1402] cdb1 var2

    [main] [2015-11-11 04:04:20.887 EST] [CommonAttributes.replaceVariables:1402] var2/u01/app/oracle

    [main] [2015-11-11 04:04:20.887 EST] [CommonAttributes.replaceVariables:1402] cdb1 var2

    [main] [2015-11-11 04:04:20.887 EST] [CommonAttributes.replaceVariables:1402] var2/u01/app/oracle

    [main] [2015-11-11 04:04:20.888 EST] [CommonAttributes.replaceVariables:1402] cdb1 var2

    [main] [2015-11-11 04:04:20.888 EST] [CommonAttributes.replaceVariables:1402] var2/u01/app/oracle

    [main] [2015-11-11 04:04:20.888 EST] [CommonAttributes.replaceVariables:1402] cdb1 var2

    [main] [2015-11-11 04:04:20.888 EST] [CommonAttributes.replaceVariables:1402] var2/u01/app/oracle

    [main] [2015-11-11 04:04:20.888 EST] [CommonAttributes.replaceVariables:1402] cdb1 var2

    [main] [2015-11-11 04:04:20.888 EST] [CommonAttributes.replaceVariables:1402] var2/u01/app/oracle

    [main] [2015-11-11 04:04:20.888 EST] [CommonAttributes.replaceVariables:1402] cdb1 var2

    [main] [2015-11-11 04:04:20.889 EST] [CommonAttributes.replaceVariables:1402] var2/u01/app/oracle

    [main] [2015-11-11 04:04:20.889 EST] [CommonAttributes.replaceVariables:1402] cdb1 var2

    [main] [2015-11-11 04:04:20.892 EST] [Host.setUpForOperation:4253]  File [0] = / u01/app/oracle

    [main] [2015-11-11 04:04:20.892 EST] [Host.setUpForOperation:4253]  [1] file = / u01/app/oracle/admin/cdb1/adump

    [main] [2015-11-11 04:04:20.892 EST] [Host.setUpForOperation:4253]  Folder [2] = / u01/app/oracle/admin/cdb1/dpdump

    [main] [2015-11-11 04:04:20.892 EST] [Host.setUpForOperation:4253]  [3] file = / u01/app/oracle/admin/cdb1/pfile

    [main] [2015-11-11 04:04:20.892 EST] [Host.setUpForOperation:4253]  [4] file = / u01/app/oracle/audit

    [main] [2015-11-11 04:04:20.893 EST] [Host.setUpForOperation:4253]  [5] file = / u01/app/oracle/cfgtoollogs/dbca/cdb1

    [main] [2015-11-11 04:04:20.893 EST] [Host.setUpForOperation:4253]  [6] file = / u01/app/oracle/fast_recovery_area

    [main] [2015-11-11 04:04:20.893 EST] [Host.setUpForOperation:4253]  [7] folder = / u01/app/oracle/fast_recovery_area/cdb1

    [main] [2015-11-11 04:04:20.893 EST] [Host.setUpForOperation:4253]  [8] file = / u01/app/oracle/oradata/cdb1

    [main] [2015-11-11 04:04:20.893 EST] [Host.setUpForOperation:4253]  [9] file = / u01/app/oracle/oradata/cdb1/pdbseed

    [main] [2015-11-11 04:04:20.893 EST] [Host.setUpForOperation:4253]  Folder[10]=/U01/app/Oracle/product/12.1.0.2/Db_1/DBS

    [main] [2015-11-11 04:04:20.893 EST] [Host.executeSteps:6091] setupForOperation returned: true

    [main] [2015-11-11 04:04:20.894 EST] [Host.createStepSQLInterface:8605] sid = cdb1

    [main] [2015-11-11 04:04:20.894 EST] Cdb1 sidOrConnectString [Host.createStepSQLInterface:8606]

    [main] [2015-11-11 04:04:20.894 EST] [OracleHome.getVersion:991]  Called OracleHome.getVersion.  Current version: null

    [main] [2015-11-11 04:04:20.895 EST] Setting [InventoryUtil.getOUIInvSession:349] YES READ at ACCESSLEVEL_READ_LOCKLESS

    [main] [2015-11-11 04:04:20.896 EST] [OracleHome.getVersion:1010]  HomeInfo /u01/app/oracle/product/12.1.0.2/db_1,1

    [main] [2015-11-11 04:04:21.043 EST] [OracleHome.getVersion:1038]  OracleHome.server.getVersion Version: 12.1.0.2.0

    [main] [2015-11-11 04:04:21.043 EST] [OracleHome.getVersion:1059]  The current Version of the inventory: 12.1.0.2.0

    [main] [2015-11-11 04:04:21.043 EST] [OracleHome.getVersion:991]  Called OracleHome.getVersion.  Current version: 12.1.0.2.0

    [main] [2015-11-11 04:04:21.043 EST] [OracleHome.getVersion:1059]  The current Version of the inventory: 12.1.0.2.0

    [main] [2015-11-11 04:04:21.044 EST] [OracleHome.getVersion:991]  Called OracleHome.getVersion.  Current version: 12.1.0.2.0

    [main] [2015-11-11 04:04:21.044 EST] [OracleHome.getVersion:1059]  The current Version of the inventory: 12.1.0.2.0

    [main] [2015-11-11 04:04:21.044 EST] [SQLPlusEngine.getCmmdParams:225] m_home 12.1.0.2.0

    [main] [2015-11-11 04:04:21.044 EST] True for 112 > version [SQLPlusEngine.getCmmdParams:226]

    [main] [2015-11-11 04:04:21.044 EST] [SQLEngine.getEnvParams:602]  By default the NLS_LANG: AMERICAN_AMERICA. AL32UTF8

    [main] [2015-11-11 04:04:21.044 EST] [SQLEngine.getEnvParams:612]  NLS_LANG: AMERICAN_AMERICA. AL32UTF8

    [main] [2015-11-11 04:04:21.045 EST] [SQLEngine.initialize:358]  SQLPLUS/OPEN process execing...

    [main] [2015-11-11 04:04:21.056 EST] M_bReaderStarted [SQLEngine.initialize:395]: false

    [main] [2015-11-11 04:04:21.056 EST] [SQLEngine.initialize:399]  From the wire drive...

    [Thread-18] [2015-11-11 04:04:21.060 EST] Setting [InventoryUtil.getOUIInvSession:349] YES READ at ACCESSLEVEL_READ_LOCKLESS

    [Thread-18] [2015-11-11 04:04:21.060 EST] [InventoryUtil.getHomeName:113] homeName = OraDB12Home1

    [Thread-18] [2015-11-11 04:04:21.061 EST] [StepManager.getSteps:275] record defined folder: / u01/app/oracle/cfgtoollogs/dbca/cdb1

    [Thread-18] [2015-11-11 04:04:21.062 EST] [StepManager.getSteps:295] ckFileName /u01/app/oracle/cfgtoollogs/dbca/cdb1/OraDB12Home1_cdb1_creation_checkpoint.xml ckContext [email protected]

    [Thread-18] [2015-11-11 04:04:21.081 EST] FailedChkFiles [CheckpointContext.isCleanupNeeded:140] {/ u01/app/oracle/cfgtoollogs/dbca/cdb1/OraDB12Home1_cdb1_creation_checkpoint.xml=null}

    [Thread-18] [2015-11-11 04:04:21.081 EST] [CheckpointContext.isCleanupNeeded:149]  Could not verify the files [email protected] iterator

    [Thread-18] [2015-11-11 04:04:21.081 EST] [CheckpointContext.isCleanupNeeded:155] failed chjeckpoint file /u01/app/oracle/cfgtoollogs/dbca/cdb1/OraDB12Home1_cdb1_creation_checkpoint.xml

    [Thread-18] [2015-11-11 04:04:21.081 EST] [CheckpointContext.isCleanupNeeded:160] get all the list of control point

    [Thread-18] [2015-11-11 04:04:21.082 EST] [CheckpointContext.getAllCheckPoints:224] get all the list of control point

    [Thread-18] [2015-11-11 04:04:21.082 EST] [CheckpointContext.getAllCheckPoints:226] return all list of control point

    [Thread-18] [2015-11-11 04:04:21.082 EST] [CheckpointContext.isCleanupNeeded:163] all the checkpoint size 1 list

    [Thread-18] [2015-11-11 04:04:21.082 EST] [CheckpointContext.isCleanupNeeded:189] adding cleanup step because this is a retry operation.

    [Thread-18] [2015-11-11 04:04:21.082 EST] Old file deleted [CheckpointContext.isCleanupNeeded:196] control point: true

    [Thread-18] [2015-11-11 04:04:21.083 EST] [CheckpointContext.retrieveCheckPoint:338] check point db_cdb1 is from the [email protected] file

    [Thread-18] [2015-11-11 04:04:21.083 EST] [CommandLineArguments.getCmdLineWithoutPasswords:7686] Remove password for exploitation forest-SYSPASSWORD

    [Thread-18] [2015-11-11 04:04:21.083 EST] [CommandLineArguments.getCmdLineWithoutPasswords:7686] Remove password for exploitation forest-SYSTEMPASSWORD

    [Thread-18] [2015-11-11 04:04:21.084 EST] [CommandLineArguments.getCmdLineWithoutPasswords:7686] Remove password for exploitation forest-PDBADMINPASSWORD

    [Thread-18] [2015-11-11 04:04:21.084 EST] Checkpoint [StepManager.getSteps:326] [email protected] file

    [Thread-18] [2015-11-11 04:04:21.084 EST] [StepManager.getSteps:332] adding point of session control

    [Thread-18] [2015-11-11 04:04:21.084 EST] [StepManager.getSteps:334] recorded the new session of control point for the creation of the DB

    [Thread-18] [2015-11-11 04:04:21.084 EST] [StepManager.getSteps:430]  StepManager isHARegistrationRequired: false

    [Thread-18] [2015-11-11 04:04:21.101 EST] [StepContext$ ModeRunner.run:2873]-progress necessary: = true

    [Thread-18] [2015-11-11 04:04:21.101 EST] [BasicStep.execute:250]  Execution stage: CLEANING

    [Thread-18] [2015-11-11 04:04:21.102 EST] [BasicStep.configureSettings:353] updated messageHandler = null

    [Thread-18] [2015-11-11 04:04:21.103 EST] Setting [InventoryUtil.getOUIInvSession:349] YES READ at ACCESSLEVEL_READ_LOCKLESS

    [Thread-18] [2015-11-11 04:04:21.103 EST] [InventoryUtil.getHomeName:113] homeName = OraDB12Home1

    [Thread-18] [2015-11-11 04:04:21.103 EST] [BasicStep.configureSettings:353] messageHandler being [email protected]

    [Thread-18] [2015-11-11 04:04:21.104 EST] [StepContext$ ModeRunner.run:2873]-progress necessary: = true

    [Thread-18] [2015-11-11 04:04:21.104 EST] [BasicStep.execute:250]  Execution stage: CLONE_DB_CREATION_RMAN_RESTORE

    [Thread-18] [2015-11-11 04:04:21.126 EST] Parameter [StepErrorHandler.setFatalErrors:323] Fatal Error: ORA-01092

    [Thread-18] [2015-11-11 04:04:21.126 EST] Parameter [StepErrorHandler.setFatalErrors:323] Fatal Error: ORA-01034

    [Thread-18] [2015-11-11 04:04:21.126 EST] Parameter [StepErrorHandler.setFatalErrors:323] Fatal Error: ORA-03114

    [Thread-18] [2015-11-11 04:04:21.127 EST] Parameter [StepErrorHandler.setFatalErrors:323] Fatal Error: ORA-12560

    [Thread-18] [2015-11-11 04:04:21.127 EST] Parameter [StepErrorHandler.setIgnorableErrors:251] error can be ignored: ORA-01109

    [Thread-18] [2015-11-11 04:04:21.127 EST] [BasicStep.configureSettings:353] updated messageHandler = null

    [Thread-18] [2015-11-11 04:04:21.127 EST] [Host.getRMANConnectionInfo:1171]  To connect to the cdb1 Instance

    [Thread-18] [2015-11-11 04:04:21.129 EST] [BasicStep.execute:250]  Execution stage: INSTANCE_CREATION

    [Thread-18] [2015-11-11 04:04:21.129 EST] [BasicStep.configureSettings:353] updated messageHandler = null

    [Thread-18] [2015-11-11 04:04:21.129 EST] [InitParamAttributes.setPluggableDatabase:5115] setPluggableDatabase: bInclude = true

    [Thread-18] [2015-11-11 04:04:21.131 EST] [CommonAttributes.replaceVariables:1402] var2/u01/app/oracle

    [Thread-18] [2015-11-11 04:04:21.131 EST] [CommonAttributes.replaceVariables:1402] cdb1 var2

    [Thread-18] [2015-11-11 04:04:21.132 EST] [InitParamAttributes.sortParams:3916] m_sortOn: sortOn:4 - 1

    [Thread-18] [2015-11-11 04:04:21.154 EST] [InitParamAttributes.createInitFile:1811]  Init param db_block_size treatment

    [Thread-18] [2015-11-11 04:04:21.154 EST] [InitParamAttributes.createInitFile:1816]  The value is 8192

    [Thread-18] [2015-11-11 04:04:21.154 EST] [InitParamAttributes.createInitFile:1811]  Treatment open_cursors init param

    [Thread-18] [2015-11-11 04:04:21.155 EST] [InitParamAttributes.createInitFile:1816]  The value is 300

    [Thread-18] [2015-11-11 04:04:21.155 EST] [InitParamAttributes.createInitFile:1811]  Db_domain init param treatment

    [Thread-18] [2015-11-11 04:04:21.155 EST] [InitParamAttributes.createInitFile:1816]  The value is «»

    [Thread-18] [2015-11-11 04:04:21.155 EST] [InitParamAttributes.createInitFile:1811]  Treatment init param db_name

    [Thread-18] [2015-11-11 04:04:21.155 EST] [InitParamAttributes.createInitFile:1816]  The value is "cdb1".

    [Thread-18] [2015-11-11 04:04:21.155 EST] [InitParamAttributes.createInitFile:1811]  Control_files treatment init param

    [Thread-18] [2015-11-11 04:04:21.155 EST] [CommonAttributes.replaceVariables:1402] var2/u01/app/oracle

    [Thread-18] [2015-11-11 04:04:21.156 EST] [CommonAttributes.replaceVariables:1402] cdb1 var2

    [Thread-18] [2015-11-11 04:04:21.156 EST] [CommonAttributes.replaceVariables:1402] var2/u01/app/oracle

    [Thread-18] [2015-11-11 04:04:21.156 EST] [CommonAttributes.replaceVariables:1402] cdb1 var2

    [Thread-18] [2015-11-11 04:04:21.156 EST] [InitParamAttributes.createInitFile:1816]  The value is ("" / u01/app/oracle/oradata/cdb1/control01.ctl "," / u01/app/oracle/fast_recovery_area/cdb1/control02.ctl "")

    [Thread-18] [2015-11-11 04:04:21.156 EST] [InitParamAttributes.createInitFile:1811]  Treatment db_recovery_file_dest init param

    [Thread-18] [2015-11-11 04:04:21.156 EST] [CommonAttributes.replaceVariables:1402] var2/u01/app/oracle

    [Thread-18] [2015-11-11 04:04:21.157 EST] [InitParamAttributes.createInitFile:1816]  The value is ' / u01/app/oracle/fast_recovery_area.

    [Thread-18] [2015-11-11 04:04:21.157 EST] [InitParamAttributes.createInitFile:1811]  Treatment db_recovery_file_dest_size init param

    [Thread-18] [2015-11-11 04:04:21.157 EST] [InitParamAttributes.createInitFile:1816]  The value is 4560 m

    [Thread-18] [2015-11-11 04:04:21.157 EST] [InitParamAttributes.createInitFile:1811]  Compatible init param treatment

    [Thread-18] [2015-11-11 04:04:21.157 EST] [InitParamAttributes.createInitFile:1816]  The value is 12.1.0.2.0

    [Thread-18] [2015-11-11 04:04:21.157 EST] [InitParamAttributes.createInitFile:1811]  Treatment diagnostic_dest init param

    [Thread-18] [2015-11-11 04:04:21.157 EST] [CommonAttributes.replaceVariables:1402] var2/u01/app/oracle

    [Thread-18] [2015-11-11 04:04:21.158 EST] [InitParamAttributes.createInitFile:1816]  The value is/u01/app/oracle

    [Thread-18] [2015-11-11 04:04:21.158 EST] [InitParamAttributes.createInitFile:1811]  Treatment enable_pluggable_database init param

    [Thread-18] [2015-11-11 04:04:21.158 EST] [InitParamAttributes.createInitFile:1816]  The value is true

    [Thread-18] [2015-11-11 04:04:21.158 EST] [InitParamAttributes.createInitFile:1811]  Treatment memory_target init param

    [Thread-18] [2015-11-11 04:04:21.158 EST] [InitParamAttributes.createInitFile:1816]  The value is 396 m

    [Thread-18] [2015-11-11 04:04:21.158 EST] [InitParamAttributes.createInitFile:1811]  Treatment of the process init param

    [Thread-18] [2015-11-11 04:04:21.158 EST] [InitParamAttributes.createInitFile:1816]  The value is 300

    [Thread-18] [2015-11-11 04:04:21.159 EST] [InitParamAttributes.createInitFile:1811]  Treatment audit_file_dest init param

    [Thread-18] [2015-11-11 04:04:21.159 EST] [CommonAttributes.replaceVariables:1402] var2/u01/app/oracle

    [Thread-18] [2015-11-11 04:04:21.159 EST] [CommonAttributes.replaceVariables:1402] cdb1 var2

    [Thread-18] [2015-11-11 04:04:21.159 EST] [InitParamAttributes.createInitFile:1816]  The value is ' / u01/app/oracle/admin/cdb1/adump.

    [Thread-18] [2015-11-11 04:04:21.159 EST] [InitParamAttributes.createInitFile:1811]  Audit_trail init param treatment

    [Thread-18] [2015-11-11 04:04:21.159 EST] [InitParamAttributes.createInitFile:1816]  The value is db

    [Thread-18] [2015-11-11 04:04:21.159 EST] [InitParamAttributes.createInitFile:1811]  Treatment remote_login_passwordfile init param

    [Thread-18] [2015-11-11 04:04:21.160 EST] [InitParamAttributes.createInitFile:1816]  The value is EXCLUSIVE

    [Thread-18] [2015-11-11 04:04:21.160 EST] [InitParamAttributes.createInitFile:1811]  Treatment of init param dispatchers

    [Thread-18] [2015-11-11 04:04:21.160 EST] [CommonAttributes.replaceVariables:1402] cdb1 var2

    [Thread-18] [2015-11-11 04:04:21.160 EST] [InitParamAttributes.createInitFile:1816]  The value is "(PROTOCOL=TCP) (SERVICE = cdb1XDB)" "

    [Thread-18] [2015-11-11 04:04:21.160 EST] [InitParamAttributes.createInitFile:1811]  Treatment undo_tablespace init param

    [Thread-18] [2015-11-11 04:04:21.160 EST] [InitParamAttributes.createInitFile:1816]  The value is UNDOTBS1

    [Thread-18] [2015-11-11 04:04:21.162 EST] [HADatabaseUtils.isGridMgmtDB:2842]  Mgmt DBName srvm _mgmtdb

    [Thread-18] [2015-11-11 04:04:21.162 EST] [InstanceStep.executeImpl:280]  Check the registry with HA listener

    [Thread-18] [2015-11-11 04:04:21.162 EST] [Host.noEntryinOratab:7194]  Check for oratab arg passed...

    [Thread-18] [2015-11-11 04:04:21.163 EST] [Oratab.getTempFile:805]  Oratab Temp: / tmp/oratab

    [Thread-18] [2015-11-11 04:04:21.180 EST] [InstanceStep.executeImpl:331]  Location of the password before parsing /u01/app/oracle/product/12.1.0.2/db_1/dbs/orapwcdb1 file

    [Thread-18] [2015-11-11 04:04:21.180 EST] [InstanceStep.executeImpl:333]  Location of the password before parsing /u01/app/oracle/product/12.1.0.2/db_1/dbs/orapwcdb1 file

    [Thread-18] [2015-11-11 04:04:21.181 EST] [OracleHome.getVersion:991]  Called OracleHome.getVersion.  Current version: 12.1.0.2.0

    [Thread-18] [2015-11-11 04:04:21.181 EST] [OracleHome.getVersion:1059]  The current Version of the inventory: 12.1.0.2.0

    [Thread-18] [2015-11-11 04:04:21.181 EST] [OracleHome.getVersion:991]  Called OracleHome.getVersion.  Current version: 12.1.0.2.0

    [Thread-18] [2015-11-11 04:04:21.181 EST] [OracleHome.getVersion:1059]  The current Version of the inventory: 12.1.0.2.0

    [Thread-18] [2015-11-11 04:04:21.181 EST] [CommonUtils.createPasswordFile:1243] orapwd new appeal for 11.1 or above

    [Thread-18] [2015-11-11 04:04:21.181 EST] [OracleHome.getVersion:991]  Called OracleHome.getVersion.  Current version: 12.1.0.2.0

    [Thread-18] [2015-11-11 04:04:21.182 EST] [OracleHome.getVersion:1059]  The current Version of the inventory: 12.1.0.2.0

    [Thread-18] [2015-11-11 04:04:21.182 EST] [OracleHome.getVersion:991]  Called OracleHome.getVersion.  Current version: 12.1.0.2.0

    [Thread-18] [2015-11-11 04:04:21.182 EST] [OracleHome.getVersion:1059]  The current Version of the inventory: 12.1.0.2.0

    [Thread-18] [2015-11-11 04:04:21.182 EST] [CommonUtils.getPasswordFileCreateCmd:1182] for new orapwd to 11.1 or above

    [Thread-18] [2015-11-11 04:04:21.184 EST] [OracleHome.getVersion:991]  Called OracleHome.getVersion.  Current version: 12.1.0.2.0

    [Thread-18] [2015-11-11 04:04:21.184 EST] [OracleHome.getVersion:1059]  The current Version of the inventory: 12.1.0.2.0

    [Thread-18] [2015-11-11 04:04:21.184 EST] [OracleHome.getVersion:991]  Called OracleHome.getVersion.  Current version: 12.1.0.2.0

    [Thread-18] [2015-11-11 04:04:21.184 EST] [OracleHome.getVersion:1059]  The current Version of the inventory: 12.1.0.2.0

    [Thread-18] [2015-11-11 04:04:21.184 EST] /U01/app/oracle/product/12.1.0.2/db_1/bin/orapwd [CommonUtils.getPasswordFileCreateCmd:1213]

    [Thread-18] [2015-11-11 04:04:21.185 EST] File=/U01/app/Oracle/product/12.1.0.2/Db_1/DBS/orapwcdb1 [CommonUtils.getPasswordFileCreateCmd:1213]

    [Thread-18] [2015-11-11 04:04:21.185 EST] Force [CommonUtils.getPasswordFileCreateCmd:1213] = y

    [Thread-18] [2015-11-11 04:04:21.185 EST] [CommonUtils.getPasswordFileCreateCmd:1213] format = 12

    [Thread-18] [2015-11-11 04:04:21.185 EST] [OsUtilsBase.execProg:2123] start execProg with the input array.

    [Thread-18] [2015-11-11 04:04:21.229 EST] [OsUtilsBase.execProg:2160] done execProg with the input array. Status: 0

    [Thread-18] [2015-11-11 04:04:21.229 EST] [InstanceStep.setASMAdminGID:373] is: wrong Type of storage: 0

    [Thread-18] [2015-11-11 04:04:21.229 EST] [BasicStep.configureSettings:353] messageHandler being [email protected]

    [Thread-18] [2015-11-11 04:04:21.229 EST] [CloneRmanRestoreStep.executeImpl:270]  The Forum went well...

    [Thread-18] [2015-11-11 04:04:21.230 EST] [CloneRmanRestoreStep.executeImpl:277] db_recovery_file_dest = ' / u01/app/oracle/fast_recovery_area.

    [Thread-18] [2015-11-11 04:04:21.230 EST] [CloneRmanRestoreStep.executeImpl:280] db_recovery_file_dest_size = 4560 m

    [Thread-18] [2015-11-11 04:04:21.230 EST] [InitParameterFile.getLongValue:687]  Perhaps the unit. Stripping device and try with 4560

    [Thread-18] [2015-11-11 04:04:21.230 EST] [CloneRmanRestoreStep.executeImpl:297]  Setting NLS_LANG to AMERICA. AL32UTF8

    [Thread-18] [2015-11-11 04:04:21.230 EST] [SQLEngine.done:2278]  Called

    [Thread-18] [2015-11-11 04:04:21.232 EST] [SQLEngine.reInitialize:785]  The SQLEngine reset...

    [Thread-18] [2015-11-11 04:04:21.232 EST] [OracleHome.getVersion:991]  Called OracleHome.getVersion.  Current version: 12.1.0.2.0

    [Thread-18] [2015-11-11 04:04:21.232 EST] [OracleHome.getVersion:1059]  The current Version of the inventory: 12.1.0.2.0

    [Thread-18] [2015-11-11 04:04:21.232 EST] [OracleHome.getVersion:991]  Called OracleHome.getVersion.  Current version: 12.1.0.2.0

    [Thread-18] [2015-11-11 04:04:21.232 EST] [OracleHome.getVersion:1059]  The current Version of the inventory: 12.1.0.2.0

    [Thread-18] [2015-11-11 04:04:21.233 EST] [OracleHome.getVersion:991]  Called OracleHome.getVersion.  Current version: 12.1.0.2.0

    [Thread-18] [2015-11-11 04:04:21.233 EST] [OracleHome.getVersion:1059]  The current Version of the inventory: 12.1.0.2.0

    [Thread-18] [2015-11-11 04:04:21.233 EST] [SQLPlusEngine.getCmmdParams:225] m_home 12.1.0.2.0

    [Thread-18] [2015-11-11 04:04:21.233 EST] True for 112 > version [SQLPlusEngine.getCmmdParams:226]

    [Thread-18] [2015-11-11 04:04:21.233 EST] [SQLEngine.getEnvParams:612]  NLS_LANG: AMERICAN_AMERICA. AL32UTF8

    [Thread-18] [2015-11-11 04:04:21.234 EST] [SQLEngine.initialize:358]  SQLPLUS/OPEN process execing...

    [Thread-18] [2015-11-11 04:04:21.243 EST] M_bReaderStarted [SQLEngine.initialize:395]: false

    [Thread-18] [2015-11-11 04:04:21.243 EST] [SQLEngine.initialize:399]  From the wire drive...

    [Thread-18] [2015-11-11 04:04:21.244 EST] [SQLEngine.initialize:448]  Waiting for m_bReaderStarted to be true

    [Thread-21] [2015-11-11 04:04:21.263 EST] [email protected]:messageHandler [BasicStep.handleNonIgnorableError:479]

    [Thread-21] [2015-11-11 04:04:21.263 EST] [BasicStep.handleNonIgnorableError:480]  ORA-12547: TNS: lost contact

    : msg

    [Thread-18] [2015-11-11 04:04:21.263 EST] [SQLEngine.setSpool:2056] old coil = null

    [Thread-18] [2015-11-11 04:04:21.264 EST] [SQLEngine.setSpool:2057]  Layout = /u01/app/oracle/cfgtoollogs/dbca/cdb1/CloneRmanRestore.log coil

    [Thread-18] [2015-11-11 04:04:21.264 EST] [SQLEngine.setSpool:2058]  Coil is editable? -> true

    [Thread-18] [2015-11-11 04:04:21.264 EST] [CloneRmanRestoreStep.executeImpl:323] _diag_hm_rc_enabled false

    [Thread-18] [2015-11-11 04:04:21.264 EST] [CommonAttributes.replaceVariables:1402] /u01/app/oracle/product/12.1.0.2/db_1 var2

    [Thread-18] [2015-11-11 04:04:21.264 EST] [CloneRmanRestoreStep.executeImpl:358]  The control file using: /u01/app/oracle/product/12.1.0.2/db_1/assistants/dbca/templates/Seed_Database.ctl. sourceDBName: seeddata

    [Thread-18] [2015-11-11 04:04:21.265 EST] [OsUtilsBase.copyFile:1505]  OsUtilsBase.copyFile:

    [Thread-18] [2015-11-11 04:04:21.286 EST] [OsUtilsBase.copyFile:1553] * write files to complete destination...

    [Thread-18] [2015-11-11 04:04:21.289 EST] [OsUtilsBase.copyFile:1588] * copy of the file status: = true

    [Thread-18] [2015-11-11 04:04:21.291 EST] Journal of db [CloneRmanRestoreStep.executeImpl:399] update file alerts

    [Thread-18] [2015-11-11 04:04:21.291 EST] [CloneRmanRestoreStep.executeImpl:402]  Deletion of entries from v$ datafile_copy

    [Thread-18] [2015-11-11 04:04:21.292 EST] [CloneRmanRestoreStep.executeImpl:404]  Delete all entries from backup

    [Thread-18] [2015-11-11 04:04:21.292 EST] [CommonAttributes.replaceVariables:1402] var2/u01/app/oracle

    [Thread-18] [2015-11-11 04:04:21.294 EST] [CloneRmanRestoreStep.executeImpl:457]  Get the data file ID card and the names for the restoration

    [Thread-18] [2015-11-11 04:04:21.294 EST] [CommonAttributes.replaceVariables:1402] var2/u01/app/oracle

    [Thread-18] [2015-11-11 04:04:21.294 EST] [CommonAttributes.replaceVariables:1402] cdb1 var2

    [Thread-18] [2015-11-11 04:04:21.294 EST] [CloneRmanRestoreStep.getDatafileIdNameMapping:591] newname for datafile /u01/app/oracle/oradata/cdb1/sysaux01.dbf

    [Thread-18] [2015-11-11 04:04:21.294 EST] [CommonAttributes.replaceVariables:1402] var2/u01/app/oracle

    [Thread-18] [2015-11-11 04:04:21.294 EST] [CommonAttributes.replaceVariables:1402] cdb1 var2

    [Thread-18] [2015-11-11 04:04:21.295 EST] [CloneRmanRestoreStep.getDatafileIdNameMapping:591] newname for datafile /u01/app/oracle/oradata/cdb1/system01.dbf

    [Thread-18] [2015-11-11 04:04:21.295 EST] [CommonAttributes.replaceVariables:1402] var2/u01/app/oracle

    [Thread-18] [2015-11-11 04:04:21.295 EST] [CommonAttributes.replaceVariables:1402] cdb1 var2

    [Thread-18] [2015-11-11 04:04:21.295 EST] [CloneRmanRestoreStep.getDatafileIdNameMapping:591] newname for datafile /u01/app/oracle/oradata/cdb1/undotbs01.dbf

    [Thread-18] [2015-11-11 04:04:21.295 EST] [CommonAttributes.replaceVariables:1402] var2/u01/app/oracle

    [Thread-18] [2015-11-11 04:04:21.295 EST] [CommonAttributes.replaceVariables:1402] cdb1 var2

    [Thread-18] [2015-11-11 04:04:21.295 EST] [CloneRmanRestoreStep.getDatafileIdNameMapping:591] newname for datafile /u01/app/oracle/oradata/cdb1/users01.dbf

    [Thread-18] [2015-11-11 04:04:21.298 EST] [RMANUtil.getRMANUtil:147] creating new instance util

    [Thread-18] [2015-11-11 04:04:21.298 EST] [RMANUtil.getRMANUtil:148] target sid cdb1

    [Thread-18] [2015-11-11 04:04:21.298 EST] [CommonAttributes.replaceVariables:1402] /u01/app/oracle/product/12.1.0.2/db_1 var2

    [Thread-18] [2015-11-11 04:04:21.301 EST] [RMANEngine.getCmmdParams:343] with /u01/app/oracle/product/12.1.0.2/db_1/bin/rman rman

    [Thread-18] [2015-11-11 04:04:21.301 EST] [RMANEngine.getEnvParams:436]  NLS_LANG: AMERICAN_AMERICA. AL32UTF8

    [Thread-18] [2015-11-11 04:04:21.302 EST] [RMANEngine.initialize:195]  RMAN execing to initialize process...

    [Thread-18] [2015-11-11 04:04:21.313 EST] [RMANEngine.initialize:221]  RMAN created initialization process...

    [Thread-18] [2015-11-11 04:04:21.313 EST] [RMANEngine.initialize:235]  From the wire drive...

    [Thread-18] [2015-11-11 04:04:21.324 EST] [RMANEngine.initialize:239]  Player started thread for RMAN initialization process...

    [Thread-18] [2015-11-11 04:04:21.348 EST] [RMANEngine.initialize:247]  Error starting thread for RMAN initialization process...

    [Thread-18] [2015-11-11 04:04:21.348 EST] [RMANEngine.initialize:252]  Output writer created for the RMAN of initialization process...

    [Thread-18] [2015-11-11 04:04:21.348 EST] [RMANEngine.initialize:290]  Created Log writer for RMAN to initialize process...

    [Thread-18] [2015-11-11 04:04:21.349 EST] [RMANEngine.initialize:295]  M_bReaderStarted to initialize value = false

    [Thread-18] [2015-11-11 04:04:21.349 EST] [RMANEngine.initialize:299]  Waiting for m_bReaderStarted to be true

    [Thread-24] [2015-11-11 04:04:21.349 EST] [RMANEngine.run:803]  Player started thread for RMAN initialization process...

    [Thread-24] [2015-11-11 04:04:21.349 EST] [RMANEngine.run:807]  M_bReaderStarted set to true to initialize...

    [Thread-18] [2015-11-11 04:04:21.360 EST] [RMANEngine.initialize:310]  Fact certain player started for the process of RMAN to initialize...

    [Thread-18] [2015-11-11 04:04:21.360 EST] [RMANEngine.connect:775]  Don't use DO NOT OS auth to connect

    [Thread-18] [2015-11-11 04:04:21.360 EST] [RMANEngine.executeImpl:1186] m_bExecQuery = false

    [Thread-18] [2015-11-11 04:04:21.360 EST] [RMANEngine.executeImpl:1194]  Command rman process writing = connection target SYS / *.

    [Thread-18] [2015-11-11 04:04:21.361 EST] [RMANEngine.executeImpl:1222]  Advise the reader to start reading

    [Thread-24] [2015-11-11 04:04:21.361 EST] [RMANEngine.readSqlOutput:889]  Log RMAN output =

    [Thread-24] [2015-11-11 04:04:21.361 EST] [RMANEngine.readSqlOutput:889]  Connect the output RMAN = Recovery Manager: release 12.1.0.2.0 - Production Wed Nov 11 04:04:21 2015

    [Thread-24] [2015-11-11 04:04:21.361 EST] [RMANEngine.readSqlOutput:889]  Log RMAN output =

    [Thread-24] [2015-11-11 04:04:21.362 EST] [RMANEngine.readSqlOutput:889]  Connect the output RMAN = Copyright (c) 1982, 2014, Oracle and/or its affiliates.  All rights reserved.

    [Thread-24] [2015-11-11 04:04:21.402 EST] [RMANEngine.readSqlOutput:889]  Log RMAN output =

    [Thread-24] [2015-11-11 04:04:21.406 EST] [RMANEngine.readSqlOutput:889]  Connect the output = RMAN RMAN >

    [Thread-24] [2015-11-11 04:04:21.413 EST] [RMANEngine.readSqlOutput:889]  Connect the RMAN RMAN-00571 = out: =.

    [Thread-24] [2015-11-11 04:04:21.413 EST] [RMANEngine.readSqlOutput:889]  Connect the RMAN RMAN-00569 = out: = ERROR MESSAGE STACK FOLLOWS =.

    [Thread-24] [2015-11-11 04:04:21.413 EST] [RMANEngine.readSqlOutput:889]  Connect the RMAN RMAN-00571 = out: =.

    [Thread-24] [2015-11-11 04:04:21.414 EST] [RMANEngine.readSqlOutput:889]  Connect the output RMAN = ORA-12547: TNS: lost contact

    [Thread-24] [2015-11-11 04:04:21.414 EST] [RMANEngine.readSqlOutput:889]  Log RMAN output =

    [Thread-24] [2015-11-11 04:04:21.414 EST] [RMANEngine.readSqlOutput:889]  Connect the output = RMAN RMAN >

    [Thread-24] [2015-11-11 04:04:21.414 EST] [RMANEngine.readSqlOutput:889]  Connect the RMAN = game of echo output on

    [Thread-24] [2015-11-11 04:04:21.414 EST] [RMANEngine.readSqlOutput:889]  Connect the RMAN set echo off = output;

    [Thread-24] [2015-11-11 04:04:21.414 EST] [RMANEngine.readSqlOutput:932] hasError is true

    [Thread-24] [2015-11-11 04:04:21.414 EST] [RMANEngine.readSqlOutput:938]  TRACK OF THE DETECTED ERROR

    [Thread-24] [2015-11-11 04:04:21.415 EST] [RMANEngine.readSqlOutput:945] m_errHdlr = null

    [Thread-24] [2015-11-11 04:04:21.415 EST] [RMANEngine.readSqlOutput:969]  DETECTED FATAL ERROR

    [Thread-24] [2015-11-11 04:04:21.415 EST] [RMANEngine.readSqlOutput:1033]  Writer notifying to proceed because m_bInterrupted = falsebNotify = truem_bReaderDone = truem_bFatalErrorOccured = true

    [Thread-24] [2015-11-11 04:04:21.415 EST] [RMANEngine.run:817]  Return value of readSqlOutput = null

    [Thread-18] [2015-11-11 04:04:21.415 EST] [RMANEngine.executeImpl:1234]  Filled with expectation of the reader

    [Thread-18] [2015-11-11 04:04:21.415 EST] [RMANEngine.executeImpl:1249]  Appeal is as had exception

    [Thread-18] [2015-11-11 04:04:21.415 EST] [RMANEngine.done:1554]  Called

    [Thread-18] [2015-11-11 04:04:21.416 EST] [RMANEngine.executeImpl:1276]  Received the FATAL error = Recovery Manager: release 12.1.0.2.0 - Production Wed Nov 11 04:04:21 2015

    Copyright (c) 1982, 2014, Oracle and/or its affiliates.  All rights reserved.

    RMAN >

    RMAN-00571: ===========================================================

    RMAN-00569: = ERROR MESSAGE STACK FOLLOWS =.

    RMAN-00571: ===========================================================

    ORA-12547: TNS: lost contact

    RMAN >

    echo on

    [Thread-18] [2015-11-11 04:04:21.416 EST] [RMANUtil.catalogBackup:487]  The cataloguing of backups RMAN error: could not get RMANUtil

    [Thread-18] [2015-11-11 04:04:21.416 EST] Exception [CloneRmanRestoreStep.executeImpl:491] rename files of data oracle.sysman.assistants.util.rmanEngine.RMANFatalErrorException: cataloguing of backups RMAN error

    [Thread-18] [2015-11-11 04:04:21.416 EST] [BasicStep.configureSettings:353] messageHandler being [email protected]

    [Thread-18] [2015-11-11 04:04:21.416 EST] [StepContext$ ModeRunner.run:2899]  The cataloguing of backups RMAN error

    oracle.sysman.assistants.dbca.backend.CloneRmanRestoreStep.executeImpl(CloneRmanRestoreStep.java:492)

    oracle.sysman.assistants.util.step.BasicStep.execute(BasicStep.java:259)

    oracle.sysman.assistants.util.step.Step.execute(Step.java:135)

    oracle.sysman.assistants.util.step.StepContext$ ModeRunner.run (StepContext.java:2883)

    java.lang.Thread.run(Thread.java:682)

    [Thread-18] [2015-11-11 04:04:21.417 EST] [SQLEngine.done:2278]  Called

    [Thread-18] [2015-11-11 04:04:21.417 EST] [SQLEngine.spoolOff:2124]  Setting off coil = /u01/app/oracle/cfgtoollogs/dbca/cdb1/CloneRmanRestore.log

    [Thread-18] [2015-11-11 04:04:21.418 EST] [Host.createStepSQLInterface:8605] sid = cdb1

    [Thread-18] [2015-11-11 04:04:21.418 EST] Cdb1 sidOrConnectString [Host.createStepSQLInterface:8606]

    [Thread-18] [2015-11-11 04:04:21.418 EST] [OracleHome.getVersion:991]  Called OracleHome.getVersion.  Current version: null

    [Thread-18] [2015-11-11 04:04:21.420 EST] Setting [InventoryUtil.getOUIInvSession:349] YES READ at ACCESSLEVEL_READ_LOCKLESS

    [Thread-18] [2015-11-11 04:04:21.420 EST] [OracleHome.getVersion:1010]  HomeInfo /u01/app/oracle/product/12.1.0.2/db_1,1

    [Thread-18] [2015-11-11 04:04:21.525 EST] [OracleHome.getVersion:1038]  OracleHome.server.getVersion Version: 12.1.0.2.0

    [Thread-18] [2015-11-11 04:04:21.525 EST] [OracleHome.getVersion:1059]  The current Version of the inventory: 12.1.0.2.0

    [Thread-18] [2015-11-11 04:04:21.525 EST] [OracleHome.getVersion:991]  Called OracleHome.getVersion.  Current version: 12.1.0.2.0

    [Thread-18] [2015-11-11 04:04:21.525 EST] [OracleHome.getVersion:1059]  The current Version of the inventory: 12.1.0.2.0

    [Thread-18] [2015-11-11 04:04:21.526 EST] [OracleHome.getVersion:991]  Called OracleHome.getVersion.  Current version: 12.1.0.2.0

    [Thread-18] [2015-11-11 04:04:21.526 EST] [OracleHome.getVersion:1059]  The current Version of the inventory: 12.1.0.2.0

    [Thread-18] [2015-11-11 04:04:21.526 EST] [SQLPlusEngine.getCmmdParams:225] m_home 12.1.0.2.0

    [Thread-18] [2015-11-11 04:04:21.526 EST] True for 112 > version [SQLPlusEngine.getCmmdParams:226]

    [Thread-18] [2015-11-11 04:04:21.526 EST] [SQLEngine.getEnvParams:612]  NLS_LANG: AMERICAN_AMERICA. AL32UTF8

    [Thread-18] [2015-11-11 04:04:21.527 EST] [SQLEngine.initialize:358]  SQLPLUS/OPEN process execing...

    [Thread-18] [2015-11-11 04:04:21.539 EST] M_bReaderStarted [SQLEngine.initialize:395]: false

    [Thread-18] [2015-11-11 04:04:21.539 EST] [SQLEngine.initialize:399]  From the wire drive...

    [Thread-18] [2015-11-11 04:04:21.541 EST] [CloneRmanRestoreStep.cancel:722]  Partially failed cleanup of the extracted files

    [Thread-18] [2015-11-11 04:04:21.549 EST] [SQLEngine.done:2278]  Called

    [Thread-18] [2015-11-11 04:04:21.549 EST] [CloneRmanRestoreStep.cancel:737]  RMAN Cleanup failed

    [Thread-18] [2015-11-11 04:04:21.549 EST] [CloneRmanRestoreStep.cancel:738]  ORA-12547: TNS: lost contact

    oracle.sysman.assistants.util.sqlEngine.SQLEngine.executeImpl(SQLEngine.java:1739)

    oracle.sysman.assistants.util.sqlEngine.SQLEngine.connect(SQLEngine.java:987)

    oracle.sysman.assistants.dbca.backend.CloneRmanRestoreStep.cancel(CloneRmanRestoreStep.java:725)

    oracle.sysman.assistants.util.step.StepContext$ ModeRunner.cancel (StepContext.java:2979)

    oracle.sysman.assistants.util.step.StepContext$ ModeRunner.run (StepContext.java:2940)

    java.lang.Thread.run(Thread.java:682)

    [Thread-18] [2015-11-11 04:04:21.550 EST] [CloneDBCreationStep.cancel:1178]  CloneDBCreationStep.cancel (): nodeList = null

    [Thread-18] [2015-11-11 04:04:21.550 EST] [SQLEngine.reInitialize:785]  The SQLEngine reset...

    [Thread-18] [2015-11-11 04:04:21.550 EST] [OracleHome.getVersion:991]  Called OracleHome.getVersion.  Current version: 12.1.0.2.0

    [Thread-18] [2015-11-11 04:04:21.550 EST] [OracleHome.getVersion:1059]  The current Version of the inventory: 12.1.0.2.0

    [Thread-18] [2015-11-11 04:04:21.550 EST] [OracleHome.getVersion:991]  Called OracleHome.getVersion.  Current version: 12.1.0.2.0

    [Thread-18] [2015-11-11 04:04:21.550 EST] [OracleHome.getVersion:1059]  The current Version of the inventory: 12.1.0.2.0

    [Thread-18] [2015-11-11 04:04:21.550 EST] [OracleHome.getVersion:991]  Called OracleHome.getVersion.  Current version: 12.1.0.2.0

    [Thread-18] [2015-11-11 04:04:21.551 EST] [OracleHome.getVersion:1059]  The current Version of the inventory: 12.1.0.2.0

    [Thread-18] [2015-11-11 04:04:21.551 EST] [SQLPlusEngine.getCmmdParams:225] m_home 12.1.0.2.0

    [Thread-18] [2015-11-11 04:04:21.551 EST] True for 112 > version [SQLPlusEngine.getCmmdParams:226]

    [Thread-18] [2015-11-11 04:04:21.551 EST] [SQLEngine.getEnvParams:612]  NLS_LANG: AMERICAN_AMERICA. AL32UTF8

    [Thread-18] [2015-11-11 04:04:21.551 EST] [SQLEngine.initialize:358]  SQLPLUS/OPEN process execing...

    [Thread-18] [2015-11-11 04:04:21.565 EST] M_bReaderStarted [SQLEngine.initialize:395]: false

    [Thread-18] [2015-11-11 04:04:21.565 EST] [SQLEngine.initialize:399]  From the wire drive...

    [Thread-18] [2015-11-11 04:04:21.566 EST] [SQLEngine.initialize:448]  Waiting for m_bReaderStarted to be true

    [Thread-18] [2015-11-11 04:04:21.585 EST] [SQLEngine.done:2278]  Called

    [Thread-18] [2015-11-11 04:04:21.585 EST] [Oratab.getTempFile:805]  Oratab Temp: / tmp/oratab

    [Thread-18] [2015-11-11 04:04:21.586 EST] [OsUtilsBase.deleteFile:1803]  OsUtilsBase.deleteFile: /u01/app/oracle/product/12.1.0.2/db_1/dbs/orapwcdb1

    [Thread-18] [2015-11-11 04:04:21.586 EST] [OsUtilsBase.deleteFile:1803]  OsUtilsBase.deleteFile: /u01/app/oracle/product/12.1.0.2/db_1/dbs/initcdb1.ora

    [Thread-18] [2015-11-11 04:04:21.586 EST] [OsUtilsBase.deleteFile:1803]  OsUtilsBase.deleteFile: /u01/app/oracle/admin/cdb1/pfile/init.ora

    [Thread-18] [2015-11-11 04:04:21.588 EST] [CloneDBCreationStep.cancel:1225]  CloneDBCreationStep.cancel (): Jaqueline = false

    [Thread-18] [2015-11-11 04:04:21.588 EST] [CommonAttributes.replaceVariables:1402] var2/u01/app/oracle

    [Thread-18] [2015-11-11 04:04:21.588 EST] [CommonAttributes.replaceVariables:1402] cdb1 var2

    [Thread-18] [2015-11-11 04:04:21.588 EST] [OsUtilsBase.deleteFile:1803]  OsUtilsBase.deleteFile: /u01/app/oracle/oradata/cdb1/sysaux01.dbf

    [Thread-18] [2015-11-11 04:04:21.588 EST] [CommonAttributes.replaceVariables:1402] var2/u01/app/oracle

    [Thread-18] [2015-11-11 04:04:21.589 EST] [CommonAttributes.replaceVariables:1402] cdb1 var2

    [Thread-18] [2015-11-11 04:04:21.589 EST] [OsUtilsBase.deleteFile:1803]  OsUtilsBase.deleteFile: /u01/app/oracle/oradata/cdb1/system01.dbf

    [Thread-18] [2015-11-11 04:04:21.589 EST] [CommonAttributes.replaceVariables:1402] var2/u01/app/oracle

    [Thread-18] [2015-11-11 04:04:21.589 EST] [CommonAttributes.replaceVariables:1402] cdb1 var2

    [Thread-18] [2015-11-11 04:04:21.589 EST] [OsUtilsBase.deleteFile:1803]  OsUtilsBase.deleteFile: /u01/app/oracle/oradata/cdb1/undotbs01.dbf

    [Thread-18] [2015-11-11 04:04:21.589 EST] [CommonAttributes.replaceVariables:1402] var2/u01/app/oracle

    [Thread-18] [2015-11-11 04:04:21.589 EST] [CommonAttributes.replaceVariables:1402] cdb1 var2

    [Thread-18] [2015-11-11 04:04:21.589 EST] [OsUtilsBase.deleteFile:1803]  OsUtilsBase.deleteFile: /u01/app/oracle/oradata/cdb1/users01.dbf

    [Thread-18] [2015-11-11 04:04:21.590 EST] [CommonAttributes.replaceVariables:1402] var2/u01/app/oracle

    [Thread-18] [2015-11-11 04:04:21.590 EST] [CommonAttributes.replaceVariables:1402] cdb1 var2

    [Thread-18] [2015-11-11 04:04:21.590 EST] [OsUtilsBase.deleteFile:1803]  OsUtilsBase.deleteFile: /u01/app/oracle/oradata/cdb1/redo01.log

    [Thread-18] [2015-11-11 04:04:21.590 EST] [CommonAttributes.replaceVariables:1402] var2/u01/app/oracle

    [Thread-18] [2015-11-11 04:04:21.590 EST] [CommonAttributes.replaceVariables:1402] cdb1 var2

    [Thread-18] [2015-11-11 04:04:21.590 EST] [OsUtilsBase.deleteFile:1803]  OsUtilsBase.deleteFile: /u01/app/oracle/oradata/cdb1/redo02.log

    [Thread-18] [2015-11-11 04:04:21.590 EST] [CommonAttributes.replaceVariables:1402] var2/u01/app/oracle

    [Thread-18] [2015-11-11 04:04:21.591 EST] [CommonAttributes.replaceVariables:1402] cdb1 var2

    [Thread-18] [2015-11-11 04:04:21.591 EST] [OsUtilsBase.deleteFile:1803]  OsUtilsBase.deleteFile: /u01/app/oracle/oradata/cdb1/redo03.log

    [Thread-18] [2015-11-11 04:04:21.591 EST] [CommonAttributes.replaceVariables:1402] var2/u01/app/oracle

    [Thread-18] [2015-11-11 04:04:21.591 EST] [CommonAttributes.replaceVariables:1402] cdb1 var2

    [Thread-18] [2015-11-11 04:04:21.591 EST] [OsUtilsBase.deleteFile:1803]  OsUtilsBase.deleteFile: /u01/app/oracle/oradata/cdb1/control01.ctl

    [Thread-18] [2015-11-11 04:04:21.591 EST] [CommonAttributes.replaceVariables:1402] var2/u01/app/oracle

    [Thread-18] [2015-11-11 04:04:21.591 EST] [CommonAttributes.replaceVariables:1402] cdb1 var2

    [Thread-18] [2015-11-11 04:04:21.592 EST] [OsUtilsBase.deleteFile:1803]  OsUtilsBase.deleteFile: /u01/app/oracle/fast_recovery_area/cdb1/control02.ctl

    [Thread-18] [2015-11-11 04:04:21.612 EST] [SQLEngine.done:2278]  Called

    [main] [2015-11-11 04:04:21.613 EST] [SQLEngine.done:2278]  Called

    [main] [2015-11-11 04:04:21.613 EST] [Host.cleanup:3928]  Exit DBCA status is: 1

    [main] [2015-11-11 04:04:21.613 EST] [Host.cleanup:3931] checkpoint context [email protected]

    [main] [2015-11-11 04:04:21.614 EST] Setting [InventoryUtil.getOUIInvSession:349] YES READ at ACCESSLEVEL_READ_LOCKLESS

    [main] [2015-11-11 04:04:21.615 EST] [InventoryUtil.getHomeName:113] homeName = OraDB12Home1

    [main] [2015-11-11 04:04:21.615 EST] [Host.cleanup:3957] check point [email protected]

    [main] [2015-11-11 04:04:21.639 EST] [OsUtilsBase.copyFile:1505]  OsUtilsBase.copyFile:

    [main] [2015-11-11 04:04:21.640 EST] [OsUtilsBase.copyFile:1553] * write files to complete destination...

    [main] [2015-11-11 04:04:21.640 EST] [OsUtilsBase.copyFile:1588] * copy of the file status: = true

    [main] [2015-11-11 04:04:21.640 EST] [OsUtilsBase.deleteFile:1803]  OsUtilsBase.deleteFile: /u01/app/oracle/cfgtoollogs/dbca/silent.log_2015-11-11_04-04-19-AM

    [Thread-3] [2015-11-11 04:04:21.644 EST] [DbcaCleanupHook.run:44]  Cleanup began

    [Thread-3] [2015-11-11 04:04:21.645 EST] [OracleHome.cleanupDBOptionsIntance:1671]  Dummy sid = null instance DB options

    [Thread-3] [2015-11-11 04:04:21.645 EST] [DbcaCleanupHook.run:49]  Cleanup

    Thanks for your tip, but in the meantime, I managed to create a database

    What I can say is that I have not touched the "/ etc/oracle/olr.loc" file. I completely uninstalled the software Oracle of this machine and started from the beginning again. It's the addidtional steps I did:

    1. I downloaded Xming to use the GUI Installation process (it helped me a lot, but I'm sure that this step is not necessary)

    Preliminary tests have shown something.  I did then:

    2. lack of space Swap--> so I created a swap file

    3 compat-libcap1 was absent. I tried to install it, but that has not worked.

    4. that's why I had to download the RPG - GPG - KEY Oracle, install it and remane RPM-GPG-KEY-oracle-ol7 to TR/MIN-GPG-KEY-oracle. Then I could install compat-libcap1

    5. the latest (and in my opinion the most important) step is to configure the file/etc/hosts. Firstly I had no entry for Oracle there (does not), then I used the private DNS provided by Amazon (also did not work) and then I used the private IP address, as shown in the AWS management console (which worked).

    After these steps, I was able to create a database.

  • Random, lack input and error output in af:query.

    Hello

    I use JDeveloper 11.1.2.4

    I have an af:query in my jsff page. There is a question at random that I am facing. When I select the option forward and attempt to add a new attribute OR after adding a new attribute, hit the search button

    I get the error "Missing parameter and OUT to index::1. But it's random. There is no specific measure to reproduce and its presence is also much lower.

    The error does not block the system, the user can continue its work after the entry of the error. Once the user has been produced, the error is not reproduced by the same steps that were followed at the start to get the error.

    The view object is not all bind variables required in fact that the main request has not all bind variables at all. Bind variables are used in the specific view criteria and their value are being extracted from EL expression.

    Someone can help me out, what direction should I look for this issue.

    Stack trace:

    < Utils > < buildFacesMessage > ADF: addition of the following JSF error: parameter IN or OUT to missing index: 1

    java.sql.SQLException: parameter IN or OUT to missing index: 1

    at oracle.jdbc.driver.OraclePreparedStatement.processCompletedBindRow(OraclePreparedStatement.java:1937)

    at oracle.jdbc.driver.OraclePreparedStatement.executeInternal(OraclePreparedStatement.java:3764)

    at oracle.jdbc.driver.OraclePreparedStatement.executeQuery(OraclePreparedStatement.java:3823)

    at oracle.jdbc.driver.OraclePreparedStatementWrapper.executeQuery(OraclePreparedStatementWrapper.java:1671)

    at weblogic.jdbc.wrapper.PreparedStatement.executeQuery(PreparedStatement.java:135)

    at oracle.jbo.server.QueryCollection.buildResultSet(QueryCollection.java:1254)

    at oracle.jbo.server.QueryCollection.executeQuery(QueryCollection.java:913)

    at oracle.jbo.server.ViewObjectImpl.executeQueryForCollection(ViewObjectImpl.java:7282)

    at oracle.jbo.server.QueryCollection.get(QueryCollection.java:2197)

    at oracle.jbo.server.ViewRowSetIteratorImpl.getAllRowsInRangeInternal(ViewRowSetIteratorImpl.java:2182)

    at oracle.jbo.server.ViewRowSetIteratorImpl.getAllRowsInRange(ViewRowSetIteratorImpl.java:2210)

    at oracle.jbo.server.ViewRowSetImpl.getAllRowsInRange(ViewRowSetImpl.java:3074)

    at oracle.jbo.server.ViewObjectImpl.getAllRowsInRange(ViewObjectImpl.java:11293)

    at oracle.adf.model.binding.DCIteratorBinding.getAllRowsInRange(DCIteratorBinding.java:2404)

    at oracle.jbo.uicli.binding.JUCtrlHierNodeBinding.updateRangeScrolled(JUCtrlHierNodeBinding.java:2442)

    at oracle.jbo.uicli.binding.JUIteratorBinding.rangeScrolled(JUIteratorBinding.java:182)

    at oracle.jbo.common.RowSetHelper.fireRangeScrolled(RowSetHelper.java:193)

    at oracle.jbo.server.ViewRowSetIteratorImpl.notifyRangeScrolled(ViewRowSetIteratorImpl.java:3080)

    at oracle.jbo.server.ViewRowSetIteratorImpl.scrollRange(ViewRowSetIteratorImpl.java:1448)

    at oracle.jbo.server.ViewRowSetIteratorImpl.setRangeStartWithRefresh(ViewRowSetIteratorImpl.java:2755)

    at oracle.jbo.server.ViewRowSetIteratorImpl.setRangeStart(ViewRowSetIteratorImpl.java:2740)

    at oracle.jbo.server.ViewRowSetImpl.setRangeStart(ViewRowSetImpl.java:3015)

    at oracle.jbo.server.ViewObjectImpl.setRangeStart(ViewObjectImpl.java:10770)

    at oracle.adf.model.binding.DCIteratorBinding.setRangeStart(DCIteratorBinding.java:3552)

    at oracle.adfinternal.view.faces.model.binding.RowDataManager._bringInToRange(RowDataManager.java:101)

    at oracle.adfinternal.view.faces.model.binding.RowDataManager.setRowIndex(RowDataManager.java:55)

    to oracle.adfinternal.view.faces.model.binding.FacesCtrlHierBinding$ FacesModel.setRowIndex (FacesCtrlHierBinding.java:800)

    at org.apache.myfaces.trinidad.component.UIXIterator._fixupFirst(UIXIterator.java:674)

    at org.apache.myfaces.trinidad.component.UIXIterator.__encodeBegin(UIXIterator.java:649)

    at org.apache.myfaces.trinidad.component.UIXTable.__encodeBegin(UIXTable.java:175)

    at org.apache.myfaces.trinidad.component.UIXCollection.encodeBegin(UIXCollection.java:607)

    at javax.faces.component.UIComponent.encodeAll(UIComponent.java:1672)

    at org.apache.myfaces.trinidad.render.CoreRenderer.encodeChild(CoreRenderer.java:624)

    at oracle.adf.view.rich.render.RichRenderer.encodeChild(RichRenderer.java:3201)

    at oracle.adfinternal.view.faces.renderkit.rich.PanelStretchLayoutRenderer.encodeCenterFacet(PanelStretchLayoutRenderer.java:878)

    at oracle.adfinternal.view.faces.renderkit.rich.PanelStretchLayoutRenderer._encodeCenterPane(PanelStretchLayoutRenderer.java:1299)

    at oracle.adfinternal.view.faces.renderkit.rich.PanelStretchLayoutRenderer._encodeMiddlePanes(PanelStretchLayoutRenderer.java:350)

    at oracle.adfinternal.view.faces.renderkit.rich.PanelStretchLayoutRenderer.encodeAll(PanelStretchLayoutRenderer.java:315)

    at oracle.adf.view.rich.render.RichRenderer.delegateRenderer(RichRenderer.java:1700)

    to oracle.adfinternal.view.faces.renderkit.rich.PanelCollectionRenderer.access$ 1300 (PanelCollectionRenderer.java:102)

    to oracle.adfinternal.view.faces.renderkit.rich.PanelCollectionRenderer$ PanelCollectionHelper._renderStretchedContent (PanelCollectionRenderer.java:793)

    to oracle.adfinternal.view.faces.renderkit.rich.PanelCollectionRenderer$ PanelCollectionHelper._encodeAll (PanelCollectionRenderer.java:928)

    to oracle.adfinternal.view.faces.renderkit.rich.PanelCollectionRenderer$ PanelCollectionHelper.access$ 700 (PanelCollectionRenderer.java:616)

    at oracle.adfinternal.view.faces.renderkit.rich.PanelCollectionRenderer.encodeAll(PanelCollectionRenderer.java:480)

    at oracle.adf.view.rich.render.RichRenderer.encodeAll(RichRenderer.java:1452)

    at org.apache.myfaces.trinidad.render.CoreRenderer.encodeEnd(CoreRenderer.java:511)

    at org.apache.myfaces.trinidad.component.UIXComponentBase.encodeEnd(UIXComponentBase.java:923)

    at javax.faces.component.UIComponent.encodeAll(UIComponent.java:1681)

    at org.apache.myfaces.trinidad.render.CoreRenderer.encodeChild(CoreRenderer.java:624)

    at oracle.adf.view.rich.render.RichRenderer.encodeChild(RichRenderer.java:3201)

    at oracle.adfinternal.view.faces.renderkit.rich.PanelStretchLayoutRenderer.encodeCenterFacet(PanelStretchLayoutRenderer.java:878)

    at oracle.adfinternal.view.faces.renderkit.rich.PanelStretchLayoutRenderer._encodeCenterPane(PanelStretchLayoutRenderer.java:1299)

    at oracle.adfinternal.view.faces.renderkit.rich.PanelStretchLayoutRenderer._encodeMiddlePanes(PanelStretchLayoutRenderer.java:350)

    at oracle.adfinternal.view.faces.renderkit.rich.PanelStretchLayoutRenderer.encodeAll(PanelStretchLayoutRenderer.java:315)

    at oracle.adf.view.rich.render.RichRenderer.encodeAll(RichRenderer.java:1452)

    at org.apache.myfaces.trinidad.render.CoreRenderer.encodeEnd(CoreRenderer.java:511)

    at org.apache.myfaces.trinidad.component.UIXComponentBase.encodeEnd(UIXComponentBase.java:923)

    at javax.faces.component.UIComponent.encodeAll(UIComponent.java:1681)

    at org.apache.myfaces.trinidad.render.CoreRenderer.encodeChild(CoreRenderer.java:624)

    at oracle.adf.view.rich.render.RichRenderer.encodeChild(RichRenderer.java:3201)

    at oracle.adf.view.rich.render.RichRenderer.encodeStretchedChild(RichRenderer.java:2194)

    to oracle.adfinternal.view.faces.renderkit.rich.RegionRenderer.access$ 400 (RegionRenderer.java:50)

    to oracle.adfinternal.view.faces.renderkit.rich.RegionRenderer$ ChildEncoderCallback.processComponent (RegionRenderer.java:707)

    to oracle.adfinternal.view.faces.renderkit.rich.RegionRenderer$ ChildEncoderCallback.processComponent (RegionRenderer.java:692)

    at org.apache.myfaces.trinidad.component.UIXComponent.processFlattenedChildren(UIXComponent.java:187)

    at org.apache.myfaces.trinidad.component.UIXComponent.processFlattenedChildren(UIXComponent.java:318)

    at org.apache.myfaces.trinidad.component.UIXComponent.encodeFlattenedChildren(UIXComponent.java:283)

    at oracle.adfinternal.view.faces.renderkit.rich.RegionRenderer._encodeChildren(RegionRenderer.java:297)

    at oracle.adfinternal.view.faces.renderkit.rich.RegionRenderer.encodeAll(RegionRenderer.java:186)

    at oracle.adf.view.rich.render.RichRenderer.encodeAll(RichRenderer.java:1452)

    at org.apache.myfaces.trinidad.render.CoreRenderer.encodeEnd(CoreRenderer.java:511)

    at org.apache.myfaces.trinidad.component.UIXComponentBase.encodeEnd(UIXComponentBase.java:923)

    at oracle.adf.view.rich.component.fragment.UIXRegion.encodeEnd(UIXRegion.java:323)

    at javax.faces.component.UIComponent.encodeAll(UIComponent.java:1681)

    at org.apache.myfaces.trinidad.component.UIXGroup.encodeChildren(UIXGroup.java:170)

    at javax.faces.component.UIComponent.encodeAll(UIComponent.java:1674)

    at org.apache.myfaces.trinidad.render.CoreRenderer.encodeChild(CoreRenderer.java:624)

    at oracle.adf.view.rich.render.RichRenderer.encodeChild(RichRenderer.java:3201)

    at oracle.adfinternal.view.faces.renderkit.rich.PanelStretchLayoutRenderer.encodeCenterFacet(PanelStretchLayoutRenderer.java:878)

    at oracle.adfinternal.view.faces.renderkit.rich.PanelStretchLayoutRenderer._encodeCenterPane(PanelStretchLayoutRenderer.java:1299)

    at oracle.adfinternal.view.faces.renderkit.rich.PanelStretchLayoutRenderer._encodeMiddlePanes(PanelStretchLayoutRenderer.java:350)

    at oracle.adfinternal.view.faces.renderkit.rich.PanelStretchLayoutRenderer.encodeAll(PanelStretchLayoutRenderer.java:315)

    at oracle.adf.view.rich.render.RichRenderer.encodeAll(RichRenderer.java:1452)

    at org.apache.myfaces.trinidad.render.CoreRenderer.encodeEnd(CoreRenderer.java:511)

    at org.apache.myfaces.trinidad.component.UIXComponentBase.encodeEnd(UIXComponentBase.java:923)

    at javax.faces.component.UIComponent.encodeAll(UIComponent.java:1681)

    at org.apache.myfaces.trinidad.render.CoreRenderer.encodeChild(CoreRenderer.java:624)

    at oracle.adf.view.rich.render.RichRenderer.encodeChild(RichRenderer.java:3201)

    at oracle.adfinternal.view.faces.renderkit.rich.PanelStretchLayoutRenderer.encodeCenterFacet(PanelStretchLayoutRenderer.java:878)

    at oracle.adfinternal.view.faces.renderkit.rich.PanelStretchLayoutRenderer._encodeCenterPane(PanelStretchLayoutRenderer.java:1299)

    at oracle.adfinternal.view.faces.renderkit.rich.PanelStretchLayoutRenderer._encodeMiddlePanes(PanelStretchLayoutRenderer.java:350)

    at oracle.adfinternal.view.faces.renderkit.rich.PanelStretchLayoutRenderer.encodeAll(PanelStretchLayoutRenderer.java:315)

    at oracle.adf.view.rich.render.RichRenderer.encodeAll(RichRenderer.java:1452)

    at org.apache.myfaces.trinidad.render.CoreRenderer.encodeEnd(CoreRenderer.java:511)

    at org.apache.myfaces.trinidad.component.UIXComponentBase.encodeEnd(UIXComponentBase.java:923)

    at javax.faces.component.UIComponent.encodeAll(UIComponent.java:1681)

    at org.apache.myfaces.trinidad.render.CoreRenderer.encodeChild(CoreRenderer.java:624)

    at oracle.adf.view.rich.render.RichRenderer.encodeChild(RichRenderer.java:3201)

    at oracle.adf.view.rich.render.RichRenderer.encodeStretchedChild(RichRenderer.java:2194)

    at oracle.adfinternal.view.faces.renderkit.rich.PanelSplitterRenderer._renderPane(PanelSplitterRenderer.java:1599)

    at oracle.adfinternal.view.faces.renderkit.rich.PanelSplitterRenderer.encodeAll(PanelSplitterRenderer.java:263)

    at oracle.adf.view.rich.render.RichRenderer.encodeAll(RichRenderer.java:1452)

    at org.apache.myfaces.trinidad.render.CoreRenderer.encodeEnd(CoreRenderer.java:511)

    at org.apache.myfaces.trinidad.component.UIXComponentBase.encodeEnd(UIXComponentBase.java:923)

    at javax.faces.component.UIComponent.encodeAll(UIComponent.java:1681)

    at org.apache.myfaces.trinidad.render.CoreRenderer.encodeChild(CoreRenderer.java:624)

    at oracle.adf.view.rich.render.RichRenderer.encodeChild(RichRenderer.java:3201)

    at oracle.adf.view.rich.render.RichRenderer.encodeStretchedChild(RichRenderer.java:2194)

    at oracle.adfinternal.view.faces.renderkit.rich.PanelSplitterRenderer._renderPane(PanelSplitterRenderer.java:1599)

    at oracle.adfinternal.view.faces.renderkit.rich.PanelSplitterRenderer.encodeAll(PanelSplitterRenderer.java:279)

    at oracle.adf.view.rich.render.RichRenderer.encodeAll(RichRenderer.java:1452)

    at org.apache.myfaces.trinidad.render.CoreRenderer.encodeEnd(CoreRenderer.java:511)

    at org.apache.myfaces.trinidad.component.UIXComponentBase.encodeEnd(UIXComponentBase.java:923)

    at javax.faces.component.UIComponent.encodeAll(UIComponent.java:1681)

    at org.apache.myfaces.trinidad.render.CoreRenderer.encodeChild(CoreRenderer.java:624)

    at oracle.adf.view.rich.render.RichRenderer.encodeChild(RichRenderer.java:3201)

    at oracle.adfinternal.view.faces.renderkit.rich.DecorativeBoxRenderer.encodeFacet(DecorativeBoxRenderer.java:440)

    at oracle.adfinternal.view.faces.renderkit.rich.DecorativeBoxRenderer._encodeCenterPane(DecorativeBoxRenderer.java:711)

    at oracle.adfinternal.view.faces.renderkit.rich.DecorativeBoxRenderer.encodeAll(DecorativeBoxRenderer.java:380)

    at oracle.adf.view.rich.render.RichRenderer.encodeAll(RichRenderer.java:1452)

    at org.apache.myfaces.trinidad.render.CoreRenderer.encodeEnd(CoreRenderer.java:511)

    at org.apache.myfaces.trinidad.component.UIXComponentBase.encodeEnd(UIXComponentBase.java:923)

    at javax.faces.component.UIComponent.encodeAll(UIComponent.java:1681)

    at org.apache.myfaces.trinidad.render.CoreRenderer.encodeChild(CoreRenderer.java:624)

    at oracle.adf.view.rich.render.RichRenderer.encodeChild(RichRenderer.java:3201)

    at oracle.adf.view.rich.render.RichRenderer.encodeStretchedChild(RichRenderer.java:2194)

    at oracle.adfinternal.view.faces.renderkit.rich.PanelSplitterRenderer._renderPane(PanelSplitterRenderer.java:1599)

    at oracle.adfinternal.view.faces.renderkit.rich.PanelSplitterRenderer.encodeAll(PanelSplitterRenderer.java:279)

    at oracle.adf.view.rich.render.RichRenderer.encodeAll(RichRenderer.java:1452)

    at org.apache.myfaces.trinidad.render.CoreRenderer.encodeEnd(CoreRenderer.java:511)

    at org.apache.myfaces.trinidad.component.UIXComponentBase.encodeEnd(UIXComponentBase.java:923)

    at javax.faces.component.UIComponent.encodeAll(UIComponent.java:1681)

    at org.apache.myfaces.trinidad.render.CoreRenderer.encodeChild(CoreRenderer.java:624)

    at oracle.adf.view.rich.render.RichRenderer.encodeChild(RichRenderer.java:3201)

    at oracle.adfinternal.view.faces.renderkit.rich.DecorativeBoxRenderer.encodeFacet(DecorativeBoxRenderer.java:440)

    at oracle.adfinternal.view.faces.renderkit.rich.DecorativeBoxRenderer._encodeCenterPane(DecorativeBoxRenderer.java:711)

    at oracle.adfinternal.view.faces.renderkit.rich.DecorativeBoxRenderer.encodeAll(DecorativeBoxRenderer.java:380)

    at oracle.adf.view.rich.render.RichRenderer.encodeAll(RichRenderer.java:1452)

    at org.apache.myfaces.trinidad.render.CoreRenderer.encodeEnd(CoreRenderer.java:511)

    at org.apache.myfaces.trinidad.component.UIXComponentBase.encodeEnd(UIXComponentBase.java:923)

    at javax.faces.component.UIComponent.encodeAll(UIComponent.java:1681)

    at org.apache.myfaces.trinidad.render.CoreRenderer.encodeChild(CoreRenderer.java:624)

    at oracle.adf.view.rich.render.RichRenderer.encodeChild(RichRenderer.java:3201)

    at oracle.adf.view.rich.render.RichRenderer.encodeStretchedChild(RichRenderer.java:2194)

    at oracle.adfinternal.view.faces.renderkit.rich.PanelSplitterRenderer._renderPane(PanelSplitterRenderer.java:1599)

    at oracle.adfinternal.view.faces.renderkit.rich.PanelSplitterRenderer.encodeAll(PanelSplitterRenderer.java:263)

    at oracle.adf.view.rich.render.RichRenderer.encodeAll(RichRenderer.java:1452)

    at org.apache.myfaces.trinidad.render.CoreRenderer.encodeEnd(CoreRenderer.java:511)

    at org.apache.myfaces.trinidad.component.UIXComponentBase.encodeEnd(UIXComponentBase.java:923)

    at javax.faces.component.UIComponent.encodeAll(UIComponent.java:1681)

    at org.apache.myfaces.trinidad.render.CoreRenderer.encodeChild(CoreRenderer.java:624)

    at oracle.adf.view.rich.render.RichRenderer.encodeChild(RichRenderer.java:3201)

    at oracle.adf.view.rich.render.RichRenderer.encodeStretchedChild(RichRenderer.java:2194)

    at oracle.adfinternal.view.faces.renderkit.rich.PanelSplitterRenderer._renderPane(PanelSplitterRenderer.java:1599)

    at oracle.adfinternal.view.faces.renderkit.rich.PanelSplitterRenderer.encodeAll(PanelSplitterRenderer.java:279)

    at oracle.adf.view.rich.render.RichRenderer.encodeAll(RichRenderer.java:1452)

    at org.apache.myfaces.trinidad.render.CoreRenderer.encodeEnd(CoreRenderer.java:511)

    at org.apache.myfaces.trinidad.component.UIXComponentBase.encodeEnd(UIXComponentBase.java:923)

    at javax.faces.component.UIComponent.encodeAll(UIComponent.java:1681)

    at org.apache.myfaces.trinidad.render.CoreRenderer.encodeChild(CoreRenderer.java:624)

    at oracle.adf.view.rich.render.RichRenderer.encodeChild(RichRenderer.java:3201)

    at org.apache.myfaces.trinidad.render.CoreRenderer.encodeAllChildren(CoreRenderer.java:641)

    at oracle.adf.view.rich.render.RichRenderer.encodeAllChildrenInContext(RichRenderer.java:3062)

    at oracle.adfinternal.view.faces.renderkit.rich.PageTemplateRenderer.encodeAll(PageTemplateRenderer.java:68)

    at oracle.adf.view.rich.render.RichRenderer.encodeAll(RichRenderer.java:1452)

    at org.apache.myfaces.trinidad.render.CoreRenderer.encodeEnd(CoreRenderer.java:511)

    at org.apache.myfaces.trinidad.component.UIXComponentBase.encodeEnd(UIXComponentBase.java:923)

    at javax.faces.component.UIComponent.encodeAll(UIComponent.java:1681)

    at org.apache.myfaces.trinidad.render.CoreRenderer.encodeChild(CoreRenderer.java:624)

    at oracle.adf.view.rich.render.RichRenderer.encodeChild(RichRenderer.java:3201)

    at org.apache.myfaces.trinidad.render.CoreRenderer.encodeAllChildren(CoreRenderer.java:641)

    at oracle.adf.view.rich.render.RichRenderer.encodeAllChildrenInContext(RichRenderer.java:3062)

    at oracle.adfinternal.view.faces.renderkit.rich.FormRenderer.encodeAll(FormRenderer.java:274)

    at oracle.adf.view.rich.render.RichRenderer.encodeAll(RichRenderer.java:1452)

    at org.apache.myfaces.trinidad.render.CoreRenderer.encodeEnd(CoreRenderer.java:511)

    at org.apache.myfaces.trinidad.component.UIXComponentBase.encodeEnd(UIXComponentBase.java:923)

    at javax.faces.component.UIComponent.encodeAll(UIComponent.java:1681)

    at org.apache.myfaces.trinidad.render.CoreRenderer.encodeChild(CoreRenderer.java:624)

    at oracle.adf.view.rich.render.RichRenderer.encodeChild(RichRenderer.java:3201)

    at org.apache.myfaces.trinidad.render.CoreRenderer.encodeAllChildren(CoreRenderer.java:641)

    at oracle.adf.view.rich.render.RichRenderer.encodeAllChildrenInContext(RichRenderer.java:3062)

    at oracle.adfinternal.view.faces.renderkit.rich.DocumentRenderer.encodeAll(DocumentRenderer.java:1275)

    at oracle.adf.view.rich.render.RichRenderer.encodeAll(RichRenderer.java:1452)

    at org.apache.myfaces.trinidad.render.CoreRenderer.encodeEnd(CoreRenderer.java:511)

    at org.apache.myfaces.trinidad.component.UIXComponentBase.encodeEnd(UIXComponentBase.java:923)

    at javax.faces.component.UIComponent.encodeAll(UIComponent.java:1681)

    at oracle.adfinternal.view.faces.context.PartialViewContextImpl._processRender(PartialViewContextImpl.java:321)

    at oracle.adfinternal.view.faces.context.PartialViewContextImpl.processPartial(PartialViewContextImpl.java:152)

    at javax.faces.component.UIViewRoot.encodeChildren(UIViewRoot.java:974)

    at javax.faces.component.UIComponent.encodeAll(UIComponent.java:1674)

    at oracle.adfinternal.view.faces.component.AdfViewRoot.encodeAll(AdfViewRoot.java:91)

    at com.sun.faces.application.view.FaceletViewHandlingStrategy.renderView(FaceletViewHandlingStrategy.java:399)

    to org.apache.myfaces.trinidadinternal.application.ViewDeclarationLanguageFactoryImpl$ ChangeApplyingVDLWrapper.renderView (ViewDeclarationLanguageFactoryImpl.java:350)

    at com.sun.faces.application.view.MultiViewHandler.renderView(MultiViewHandler.java:131)

    at javax.faces.application.ViewHandlerWrapper.renderView(ViewHandlerWrapper.java:273)

    at org.apache.myfaces.trinidadinternal.application.ViewHandlerImpl.renderView(ViewHandlerImpl.java:165)

    at oracle.adfinternal.view.faces.lifecycle.LifecycleImpl._renderResponse(LifecycleImpl.java:1035)

    at oracle.adfinternal.view.faces.lifecycle.LifecycleImpl._executePhase(LifecycleImpl.java:342)

    at oracle.adfinternal.view.faces.lifecycle.LifecycleImpl.render(LifecycleImpl.java:236)

    at javax.faces.webapp.FacesServlet.service(FacesServlet.java:509)

    to weblogic.servlet.internal.StubSecurityHelper$ ServletServiceAction.run (StubSecurityHelper.java:227)

    at weblogic.servlet.internal.StubSecurityHelper.invokeServlet(StubSecurityHelper.java:125)

    at weblogic.servlet.internal.ServletStubImpl.execute(ServletStubImpl.java:300)

    at weblogic.servlet.internal.TailFilter.doFilter(TailFilter.java:26)

    at weblogic.servlet.internal.FilterChainImpl.doFilter(FilterChainImpl.java:56)

    at oracle.adf.model.servlet.ADFBindingFilter.doFilter(ADFBindingFilter.java:173)

    at weblogic.servlet.internal.FilterChainImpl.doFilter(FilterChainImpl.java:56)

    at oracle.adfinternal.view.faces.webapp.rich.RegistrationFilter.doFilter(RegistrationFilter.java:125)

    to org.apache.myfaces.trinidadinternal.webapp.TrinidadFilterImpl$ FilterListChain.doFilter (TrinidadFilterImpl.java:468)

    at oracle.adfinternal.view.faces.activedata.AdsFilter.doFilter(AdsFilter.java:60)

    to org.apache.myfaces.trinidadinternal.webapp.TrinidadFilterImpl$ FilterListChain.doFilter (TrinidadFilterImpl.java:468)

    at org.apache.myfaces.trinidadinternal.webapp.TrinidadFilterImpl._doFilterImpl(TrinidadFilterImpl.java:293)

    at org.apache.myfaces.trinidadinternal.webapp.TrinidadFilterImpl.doFilter(TrinidadFilterImpl.java:199)

    at org.apache.myfaces.trinidad.webapp.TrinidadFilter.doFilter(TrinidadFilter.java:92)

    at weblogic.servlet.internal.FilterChainImpl.doFilter(FilterChainImpl.java:56)

    at com.oracle.ofd.ba.newlayout.view.filter.security.IE11_Filter.doFilter(IE11_Filter.java:25)

    at weblogic.servlet.internal.FilterChainImpl.doFilter(FilterChainImpl.java:56)

    at com.oracle.ofd.ba.newlayout.view.filter.security.OfdSessionExpiryFilter.doFilter(OfdSessionExpiryFilter.java:45)

    at weblogic.servlet.internal.FilterChainImpl.doFilter(FilterChainImpl.java:56)

    at oracle.adf.library.webapp.LibraryFilter.doFilter(LibraryFilter.java:180)

    at weblogic.servlet.internal.FilterChainImpl.doFilter(FilterChainImpl.java:56)

    at com.oracle.ofd.ba.newlayout.view.filter.security.OfdSecurityFilter.doFilter(OfdSecurityFilter.java:71)

    at weblogic.servlet.internal.FilterChainImpl.doFilter(FilterChainImpl.java:56)

    to oracle.security.jps.ee.http.JpsAbsFilter$ 1.run(JpsAbsFilter.java:119)

    at java.security.AccessController.doPrivileged (Native Method)

    at oracle.security.jps.util.JpsSubject.doAsPrivileged(JpsSubject.java:315)

    at oracle.security.jps.ee.util.JpsPlatformUtil.runJaasMode(JpsPlatformUtil.java:442)

    at oracle.security.jps.ee.http.JpsAbsFilter.runJaasMode(JpsAbsFilter.java:103)

    at oracle.security.jps.ee.http.JpsAbsFilter.doFilter(JpsAbsFilter.java:171)

    at oracle.security.jps.ee.http.JpsFilter.doFilter(JpsFilter.java:71)

    at weblogic.servlet.internal.FilterChainImpl.doFilter(FilterChainImpl.java:56)

    at oracle.dms.servlet.DMSServletFilter.doFilter(DMSServletFilter.java:139)

    at weblogic.servlet.internal.FilterChainImpl.doFilter(FilterChainImpl.java:56)

    at weblogic.servlet.internal.RequestEventsFilter.doFilter(RequestEventsFilter.java:27)

    at weblogic.servlet.internal.FilterChainImpl.doFilter(FilterChainImpl.java:56)

    to weblogic.servlet.internal.WebAppServletContext$ ServletInvocationAction.wrapRun (WebAppServletContext.java:3715)

    to weblogic.servlet.internal.WebAppServletContext$ ServletInvocationAction.run (WebAppServletContext.java:3681)

    at weblogic.security.acl.internal.AuthenticatedSubject.doAs(AuthenticatedSubject.java:321)

    at weblogic.security.service.SecurityManager.runAs(SecurityManager.java:120)

    at weblogic.servlet.internal.WebAppServletContext.securedExecute(WebAppServletContext.java:2277)

    at weblogic.servlet.internal.WebAppServletContext.execute(WebAppServletContext.java:2183)

    at weblogic.servlet.internal.ServletRequestImpl.run(ServletRequestImpl.java:1454)

    at weblogic.work.ExecuteThread.execute(ExecuteThread.java:209)

    at weblogic.work.ExecuteThread.run(ExecuteThread.java:178)

    Thank you

    It's the application. We were not able to get the first cause, but occurred because of changes in the parameter optimization of the View object.

    To improve performance, the parameter Access Mode is set to the pagination of the range. When he changed the Scrollable value then the issue has not been seen.

  • DBUM target Recon - java.sql.SQLSyntaxErrorException error: ORA-00942: table or view does not exist

    Hello

    When I run DBUM Targer user reconciliation (recon Filtered) I get the error in the log below.

    We have created an account with privileges below target. y at - it all permisssions more necessary for execution of the reconciliation of the target.

    [2015-10 - 09T 10: 47:45.717 - 07:00] [oimext_server1] [NOTIFICATION] [] [oracle.iam.scheduler.vo] [tid: OIMQuartzScheduler_Worker-4] [username: oiminternal] [ecid: 77744a889dde03de:-265ee4b8:15049ac7206: - 8000-0000000000000004, 1:18393] [APP: IOM #11.1.2.0.0] details executeJob DBUM Oracle user target reconciliation method

    [2015-10 - 09T 10: 47:45.842 - 07:00] [oimext_server1] [WARNING] [] [ORG. IDENTITYCONNECTORS. DBUM. DBUMCONNECTOR] [tid: Thread-276] [username: oiminternal] [ecid: 77744a889dde03de:-265ee4b8:15049ac7206: - 8000 - 1:18558 0000000000000004,] [APP: IOM #11.1.2.0.0] org.identityconnectors.dbum.DBUMConnector: parseConnectionProperties: no connection properties

    [2015-10 - 09T 10: 47:45.878 - 07:00] [oimext_server1] [WARNING] [] [ORG. IDENTITYCONNECTORS. DBUM. DBUMCONNECTOR] [tid: Thread-276] [username: oiminternal] [ecid: 77744a889dde03de:-265ee4b8:15049ac7206: - 8000-0000000000000004, 1:18558] [APP: IOM #11.1.2.0.0] org.identityconnectors.dbum.DBUMConnector: dropUnusedSearchAttributes: fall tmpQuota

    [2015-10 - 09T 10: 47:45.879 - 07:00] [oimext_server1] [WARNING] [] [ORG. IDENTITYCONNECTORS. DBUM. DBUMCONNECTOR] [tid: Thread-276] [username: oiminternal] [ecid: 77744a889dde03de:-265ee4b8:15049ac7206: - 8000-0000000000000004, 1:18558] [APP: IOM #11.1.2.0.0] org.identityconnectors.dbum.DBUMConnector: dropUnusedSearchAttributes: fall tmpQuota

    [2015-10 - 09T 10: 47:45.881 - 07:00] [oimext_server1] [ERROR] [] [ORG. IDENTITYCONNECTORS. DBUM. SQLEXECUTIONHANDLER] [tid: Thread-276] [username: oiminternal] [ecid: 77744a889dde03de:-265ee4b8:15049ac7206: - 8000-0000000000000004, 1:18558] [APP: IOM #11.1.2.0.0] org.identityconnectors.dbum.SQLExecutionHandler: executeAccountSearch: error when searching for user records [[ ]]

    java.sql.SQLSyntaxErrorException: ORA-00942: table or view does not exist

    at oracle.jdbc.driver.T4CTTIoer.processError(T4CTTIoer.java:462)

    at oracle.jdbc.driver.T4CTTIoer.processError(T4CTTIoer.java:405)

    at oracle.jdbc.driver.T4C8Oall.processError(T4C8Oall.java:931)

    at oracle.jdbc.driver.T4CTTIfun.receive(T4CTTIfun.java:481)

    at oracle.jdbc.driver.T4CTTIfun.doRPC(T4CTTIfun.java:205)

    at oracle.jdbc.driver.T4C8Oall.doOALL(T4C8Oall.java:548)

    at oracle.jdbc.driver.T4CPreparedStatement.doOall8(T4CPreparedStatement.java:217)

    at oracle.jdbc.driver.T4CPreparedStatement.executeForDescribe(T4CPreparedStatement.java:947)

    at oracle.jdbc.driver.OracleStatement.executeMaybeDescribe(OracleStatement.java:1283)

    at oracle.jdbc.driver.OracleStatement.doExecuteWithTimeout(OracleStatement.java:1441)

    at oracle.jdbc.driver.OraclePreparedStatement.executeInternal(OraclePreparedStatement.java:3769)

    at oracle.jdbc.driver.OraclePreparedStatement.executeQuery(OraclePreparedStatement.java:3823)

    at oracle.jdbc.driver.OraclePreparedStatementWrapper.executeQuery(OraclePreparedStatementWrapper.java:1671)

    at org.identityconnectors.dbum.SQLExecutionHandler.searchAccounts(SQLExecutionHandler.java:287)

    at org.identityconnectors.dbum.SQLExecutionHandler.executeAccountSearch(SQLExecutionHandler.java:95)

    at org.identityconnectors.dbum.DBUMConnector.executeQuery(DBUMConnector.java:199)

    at org.identityconnectors.dbum.DBUMConnector.executeQuery(DBUMConnector.java:74)

    at org.identityconnectors.framework.impl.api.local.operations.SearchImpl.rawSearch(SearchImpl.java:118)

    at org.identityconnectors.framework.impl.api.local.operations.SearchImpl.search(SearchImpl.java:82)

    at sun.reflect.GeneratedMethodAccessor5776.invoke (unknown Source)

    at sun.reflect.DelegatingMethodAccessorImpl.invoke(DelegatingMethodAccessorImpl.java:25)

    at java.lang.reflect.Method.invoke(Method.java:597)

    at org.identityconnectors.framework.impl.api.local.operations.ConnectorAPIOperationRunnerProxy.invoke(ConnectorAPIOperationRunnerProxy.java:93)

    to com.sun.proxy. $Proxy575.search (unknown Source)

    at sun.reflect.GeneratedMethodAccessor5776.invoke (unknown Source)

    at sun.reflect.DelegatingMethodAccessorImpl.invoke(DelegatingMethodAccessorImpl.java:25)

    at java.lang.reflect.Method.invoke(Method.java:597)

    at org.identityconnectors.framework.impl.api.local.operations.ThreadClassLoaderManagerProxy.invoke(ThreadClassLoaderManagerProxy.java:107)

    to com.sun.proxy. $Proxy575.search (unknown Source)

    at sun.reflect.GeneratedMethodAccessor5776.invoke (unknown Source)

    at sun.reflect.DelegatingMethodAccessorImpl.invoke(DelegatingMethodAccessorImpl.java:25)

    at java.lang.reflect.Method.invoke(Method.java:597)

    to org.identityconnectors.framework.impl.api.BufferedResultsProxy$ BufferedResultsHandler.run (BufferedResultsProxy.java:162)

    ]]

    [2015-10 - 09T 10: 47:45.892 - 07:00] [oimext_server1] [NOTIFICATION] [] [oracle.iam.scheduler.impl.quartz] [tid: OIMQuartzScheduler_Worker-4] [userId: oiminternal] [ecid: 77744a889dde03de:-265ee4b8:15049ac7206: - 8000-0000000000000004, 1:18393] [APP: #11.1.2.0.0 IOM] Job listener, Job was performed QuartzJobListener.jobWasExecuted Description DEFAULT null FullName. DBUM Oracle DBUM Oracle target reconciliation user name reconciliation target user

    [2015-10 - 09T 10: 47:46.116 - 07:00] [oimext_server1] [ERROR] [] [] [tid: [ASSETS].] [ExecuteThread: '6' for queue: "(self-adjusting) weblogic.kernel.Default"] [username: xelsysadm] [ecid: 77744a889dde03de:-265ee4b8:15049ac7206 :-8000-0000000000010 c 79, 0] [APP: IOM #11.1.2.0.0] [IDDM: 0000L1Dd4upEoIs6wjyWMG1M5jJP00000S] could not communicate with one of the server access set up, make sure it is running.

    [2015-10 - 09T 10: 47:46.517 - 07:00] [oimext_server1] [ERROR] [] [] [tid: Watcher] [username: < anonymous >] [ecid: 0000L19f77uEoIs6wjyWMG1M5jJP000000, 1:18404] error receive challenge server hacked

    [2015-10 - 09T 10: 47:49.271 - 07:00] [oimext_server1] [ERROR] [] [] [tid: [ASSETS].] [ExecuteThread: '12' to the queue: "(self-adjusting) weblogic.kernel.Default"] [username: xelsysadm] [ecid: 77744a889dde03de:-265ee4b8:15049ac7206:-8000-0000000000010c7c, 0] [APP: IOM #11.1.2.0.0] [IDDM: 0000L1Dd4upEoIs6wjyWMG1M5jJP00000S] could not communicate with one of the server access set up, make sure it is running.

    [2015-10 - 09T 10: 47:49.718 - 07:00] [oimext_server1] [ERROR] [] [] [tid: [ASSETS].] [ExecuteThread: '21' for queue: "(self-adjusting) weblogic.kernel.Default"] [username: xelsysadm] [ecid: 77744a889dde03de:-265ee4b8:15049ac7206:-8000-0000000000010c7e, 0] [APP: IOM #11.1.2.0.0] [IDDM: 0000L1Dd4upEoIs6wjyWMG1M5jJP00000S] could not communicate with one of the server access set up, make sure it is running.

    Thank you

    After changing the logging level for 32 track, filled with the SQL log file.

    The application consisted of a JOIN with two or three tables table (dba_users and dba_quota_tablespaces).

    After providing privileges select on the quota table, I was able to learn from the user.

    Thank you

  • Creating cloud Application hangs after the launch with error.

    I get an error after creative cloud launches which is the cause of crash immediately.

    The specific error is:

    Crashed thread: 0 CrBrowserMain dispatch queue: com.apple.main - wire

    Exception type: EXC_BAD_ACCESS (SIGSEGV)

    Exception codes: KERN_INVALID_ADDRESS at 0x0000000077c26728

    I worked through the stages here, including the creation of a new user account with administrator privileges to install the creative application of cloud

    Error "Unable to install" received when installing Adobe Creative Cloud desktop application

    I saw the other discussions on the forums where this issue has been resolved with the Creative cloud here cleaning tool:

    The Adobe Creative Cloud Cleaner tool allows to solve installation problems

    The log of any accident can be found below:

    Process: Creative cloud [2138]

    Path: / Applications/Utilities/Adobe Creative Cloud / * / Creative Cloud.app/Contents/MacOS/Creative Cloud

    ID: com.adobe.acc.AdobeCreativeCloud

    Version: 3.6.0.248 (3.6)

    Code type: X 86 (native)

    Parent process:? [1]

    Manager: Creative cloud [2138]

    ID: 1093215950

    Date/time: 2016-06-09 10:29:56.855-0700

    OS version: Mac OS X 10.10.3 (14D136)

    Report Version: 11

    Anonymous UUID: 80DA29EE-509D-8B04-91C5-431744B88BBF

    Time since started awake: 850 seconds

    Crashed thread: 0 CrBrowserMain dispatch queue: com.apple.main - wire

    Exception type: EXC_BAD_ACCESS (SIGSEGV)

    Exception codes: KERN_INVALID_ADDRESS at 0x0000000077c26728

    VM regions near 0x77c26728:

    Memory Tag 255 [100K] 000000005cb00000-000000005cb19000 rw-/ rwx SM = COW

    ->

    MALLOC_TINY 000000007ae00000 - 000000007b 000000 [2048K] rw-/ rwx SM = COW

    Request for clarification:

    objc_msgSend() selector name: free

    Thread 0 crashed: CrBrowserMain Dispatch queue: com.apple.main - wire

    libobjc 0. A.dylib 0x953d60a7 objc_msgSend + 23

    1 com.apple.CoreFoundation 0x997d1daf _CFAutoreleasePoolPop + 47

    2 com.apple.AppKit 0x92e47b50-[NSApplication finishLaunching] + 745

    3 com.apple.AppKit 0x92e47480-[NSApplication run] + 143

    4 org.chromium.ContentShell.framework 0x04e5b33d 0x4d58000 + 1061693

    5 org.chromium.ContentShell.framework 0x04e5aa6c 0x4d58000 + 1059436

    6 org.chromium.ContentShell.framework 0x04e9fc81 0x4d58000 + 1342593

    7 org.chromium.ContentShell.framework 0x04eb457f 0x4d58000 + 1426815

    8 org.chromium.ContentShell.framework 0x04e9fa2a 0x4d58000 + 1341994

    org.chromium.ContentShell.framework 9 0x04daf5b8 0x4d58000 + 357816

    10 HEX.dylib 0x023b8eb7 HEXMessageProcessor::runLoop(std::string const&) + 455

    11 HEX.dylib 0x0238b5c8 0 x 2385000 + 26056

    12 HEX.dylib 0x023c18bd HEXMessageProcessor::processMessage (const std::string &, const std::string &, ProcessMessageOutput &, MessageObject const &) + 77

    13 HEX.dylib 0x02389b2f processMessage + 175

    14 Core.dylib 0x0023a451 ExternalGateway::sendMessageToApplet (const MessageObject &, const MessageStruct *, bool (*) (const void *), const char *) + 1617

    15 Core.dylib 0x00239bd7 ExternalGateway::handleMessage (const MessageObject &, const MessageStruct *, bool (*) (const void *), const char *) + 455

    16 Core.dylib 0x0023c246 ExternalGateway::processMessageFromOutside (MessageStruct const *, bool (*) (const void *)) + 390

    17 com.adobe.acc.AdobeCreativeCloud 0x00081d85 start + 125749

    18 com.adobe.acc.AdobeCreativeCloud 0x0006f517 start + 49863

    19 com.adobe.acc.AdobeCreativeCloud 0x000717c1 start + 58737

    20 com.adobe.acc.AdobeCreativeCloud 0x00070b2f start + 55519

    21 com.adobe.acc.AdobeCreativeCloud 0 x 00063285 start + 53

    Thread 1: dispatch queue: com.apple.libdispatch - Manager

    0 libsystem_kernel.dylib 0x9bea48ce kevent64 + 10

    1 libdispatch.dylib 0x94a4073f _dispatch_mgr_invoke + 245

    2 libdispatch.dylib 0x94a403a2 _dispatch_mgr_thread + 52

    Thread 2:

    0 libsystem_kernel.dylib 0x9bea3e6a __workq_kernreturn + 10

    1 libsystem_pthread.dylib 0x968962b1 _pthread_wqthread + 939

    2 libsystem_pthread.dylib 0x96893e2e start_wqthread + 30

    3 wire:

    0 libsystem_kernel.dylib 0x9bea3e6a __workq_kernreturn + 10

    1 libsystem_pthread.dylib 0x968962b1 _pthread_wqthread + 939

    2 libsystem_pthread.dylib 0x96893e2e start_wqthread + 30

    Thread 4:

    0 libsystem_kernel.dylib 0x9bea3e6a __workq_kernreturn + 10

    1 libsystem_pthread.dylib 0x968962b1 _pthread_wqthread + 939

    2 libsystem_pthread.dylib 0x96893e2e start_wqthread + 30

    Wire 5:

    0 libsystem_kernel.dylib 0x9bea3e6a __workq_kernreturn + 10

    1 libsystem_pthread.dylib 0x968962b1 _pthread_wqthread + 939

    2 libsystem_pthread.dylib 0x96893e2e start_wqthread + 30

    Line 6:

    0 libsystem_kernel.dylib 0x9bea376e __recvfrom + 10

    recv 1 0x9aaf4d22 $UNIX2003 + 55 libsystem_c.dylib

    2 VulcanMessage5.dylib 0x01e9cfa6 vcfoundation::net:Bsd:Recv(int,_void*,_int,_int) + 46

    3 VulcanMessage5.dylib 0x01e9c082 vcfoundation::io:BSDNamedPipe:Read(void*,_unsigned_long) + 44

    4 VulcanMessage5.dylib 0x01e9b10d vcfoundation::io:BufferedReader:InternalRead(char*,_long) + 75

    5 VulcanMessage5.dylib 0x01e9b037 vcfoundation::io:BufferedReader:Read(void*,_unsigned_long) + 55

    6 VulcanMessage5.dylib 0x01e9595d vcfoundation::io:IVCChannel:ReadFully(void*,_unsigned_long) + 53

    7 VulcanMessage5.dylib 0x01e95e5e vcfoundation::io::Serializer::InternalDeserialize() + 44

    8 VulcanMessage5.dylib 0x01e95ddd vcfoundation::io::Serializer::Deserialize() + 17

    9 VulcanMessage5.dylib 0x01e99d8b vcfoundation::ncomm::Connection::ReadIn() + 21

    10 0x01e99a96 vcfoundation::ncomm:NCService:ReadResponse(vcfoundation::ncomm::INCRequest*,_vcfoundation::ncomm::INCListener&,_vcfoundation::ncomm::NCService::ConRef&) + 32 VulcanMessage5.dylib

    11 VulcanMessage5.dylib 0x01e996ef vcfoundation::ncomm:NCService:Execute(vcfoundation::ncomm::INCRequest*,_vcfoundation::ncomm::INCListener&) + 179

    12 VulcanMessage5.dylib 0x01e99636 vcfoundation::ncomm:NCService:Execute(vcfoundation::ncomm::INCRequest*) + 46

    13 VulcanMessage5.dylib 0x01e8bb7b adobe: vulcan::servicemgr::CSIRequest::Execute() + 65

    14 VulcanMessage5.dylib 0x01e8c719 adobe: vulcan::servicemgr::RegisterForEventsRequest::Run() + 1103

    15 VulcanMessage5.dylib 0x01e9a932 vcfoundation::thread::AbstractThread::Run() + 50

    16 VulcanMessage5.dylib 0x01e9c8f7 vcfoundation::thread:Thread:ThreadProc(void*) + 17

    17 libsystem_pthread.dylib 0x96895e13 _pthread_body + 138

    18 libsystem_pthread.dylib 0x96895d89 _pthread_start + 162

    19 libsystem_pthread.dylib 0x96893e52 thread_start + 34

    Line 7:

    0 libsystem_kernel.dylib 0x9be9d9ce mach_msg_trap + 10

    1 libsystem_kernel.dylib 0x9be9ca70 mach_msg + 68

    2 com.apple.CoreFoundation 0x9980def6 __CFRunLoopServiceMachPort + 214

    3 com.apple.CoreFoundation 0x9980d309 __CFRunLoopRun + 1529

    4 com.apple.CoreFoundation 0x9980caa6 CFRunLoopRunSpecific + 390

    5 com.apple.CoreFoundation 0x9980c90b CFRunLoopRunInMode + 123

    6 Analytics.dylib 0x02033ef7 0 x 2006000 + 188151

    7 Analytics.dylib 0x020331dc OOBEUtils::HTTPConnector: + 124

    8 Analytics.dylib 0x0207bda5 ETSFramework::ETSManager:sendRawXMLToETS(std::string&) + 725

    Analytics.dylib 9 0x0207b7ae ETSFramework::ETSManager:sendEvent(ETSData*) + 670

    10 Analytics.dylib 0x0207eb6d ETSFramework::AsynchEventProcessor:MainThreadProc(void*) + 477

    11 libsystem_pthread.dylib 0x96895e13 _pthread_body + 138

    12 libsystem_pthread.dylib 0x96895d89 _pthread_start + 162

    13 libsystem_pthread.dylib 0x96893e52 thread_start + 34

    Slide 8: NetworkConfigWatcher

    0 libsystem_kernel.dylib 0x9be9d9ce mach_msg_trap + 10

    1 libsystem_kernel.dylib 0x9be9ca70 mach_msg + 68

    2 com.apple.CoreFoundation 0x9980def6 __CFRunLoopServiceMachPort + 214

    3 com.apple.CoreFoundation 0x9980d309 __CFRunLoopRun + 1529

    4 com.apple.CoreFoundation 0x9980caa6 CFRunLoopRunSpecific + 390

    5 com.apple.CoreFoundation 0x9980c90b CFRunLoopRunInMode + 123

    6 com.apple.Foundation 0x9062834a-[NSRunLoop (NSRunLoop) runMode:beforeDate:] + 305

    7 org.chromium.ContentShell.framework 0x04e5b11f 0x4d58000 + 1061151

    8 org.chromium.ContentShell.framework 0x04e5aa6c 0x4d58000 + 1059436

    org.chromium.ContentShell.framework 9 0x04e9fc81 0x4d58000 + 1342593

    10 org.chromium.ContentShell.framework 0x04eb457f 0x4d58000 + 1426815

    11 org.chromium.ContentShell.framework 0x04e9fa2a 0x4d58000 + 1341994

    12 org.chromium.ContentShell.framework 0x04ecaeb1 0x4d58000 + 1519281

    13 org.chromium.ContentShell.framework 0x04ecafa2 0x4d58000 + 1519522

    14 org.chromium.ContentShell.framework 0x04ec68c5 0x4d58000 + 1501381

    15 libsystem_pthread.dylib 0x96895e13 _pthread_body + 138

    16 libsystem_pthread.dylib 0x96895d89 _pthread_start + 162

    17 libsystem_pthread.dylib 0x96893e52 thread_start + 34

    Wire 9: DnsConfigService

    0 libsystem_kernel.dylib 0x9bea48b2 kevent + 10

    1 org.chromium.ContentShell.framework 0x04edc0eb 0x4d58000 + 1589483

    2 org.chromium.ContentShell.framework 0x04ed9ceb 0x4d58000 + 1580267

    3 org.chromium.ContentShell.framework 0x04e59f15 0x4d58000 + 1056533

    4 org.chromium.ContentShell.framework 0x04e9fc81 0x4d58000 + 1342593

    5 org.chromium.ContentShell.framework 0x04eb457f 0x4d58000 + 1426815

    6 org.chromium.ContentShell.framework 0x04e9fa2a 0x4d58000 + 1341994

    7 org.chromium.ContentShell.framework 0x04ecaeb1 0x4d58000 + 1519281

    8 org.chromium.ContentShell.framework 0x04ecafa2 0x4d58000 + 1519522

    org.chromium.ContentShell.framework 9 0x04ec68c5 0x4d58000 + 1501381

    10 libsystem_pthread.dylib 0x96895e13 _pthread_body + 138

    11 libsystem_pthread.dylib 0x96895d89 _pthread_start + 162

    12 libsystem_pthread.dylib 0x96893e52 thread_start + 34

    Thread 10: WorkerPool/28171

    0 libsystem_kernel.dylib 0x9bea3512 __psynch_cvwait + 10

    1 libsystem_pthread.dylib 0x96896abe _pthread_cond_wait + 842

    2 libsystem_pthread.dylib 0x96896ce1 pthread_cond_timedwait_relative_np + 47

    3 org.chromium.ContentShell.framework 0x04ec2165 0x4d58000 + 1483109

    4 org.chromium.ContentShell.framework 0x04ecd413 0x4d58000 + 1528851

    5 org.chromium.ContentShell.framework 0x04ecd967 0x4d58000 + 1530215

    6 org.chromium.ContentShell.framework 0x04ec68c5 0x4d58000 + 1501381

    7 libsystem_pthread.dylib 0x96895e13 _pthread_body + 138

    8 libsystem_pthread.dylib 0x96895d89 _pthread_start + 162

    libsystem_pthread.dylib 9 0x96893e52 thread_start + 34

    Wire 11: WorkerPool/28947

    0 libsystem_kernel.dylib 0x9bea3512 __psynch_cvwait + 10

    1 libsystem_pthread.dylib 0x96896abe _pthread_cond_wait + 842

    2 libsystem_pthread.dylib 0x96896ce1 pthread_cond_timedwait_relative_np + 47

    3 org.chromium.ContentShell.framework 0x04ec2165 0x4d58000 + 1483109

    4 org.chromium.ContentShell.framework 0x04ecd413 0x4d58000 + 1528851

    5 org.chromium.ContentShell.framework 0x04ecd967 0x4d58000 + 1530215

    6 org.chromium.ContentShell.framework 0x04ec68c5 0x4d58000 + 1501381

    7 libsystem_pthread.dylib 0x96895e13 _pthread_body + 138

    8 libsystem_pthread.dylib 0x96895d89 _pthread_start + 162

    libsystem_pthread.dylib 9 0x96893e52 thread_start + 34

    Slide 12: OptimizingCompi

    0 libsystem_kernel.dylib 0x9be9da0a semaphore_wait_trap + 10

    1 org.chromium.ContentShell.framework 0x05853e4a 0x4d58000 + 11517514

    2 org.chromium.ContentShell.framework 0x0571224b 0x4d58000 + 10199627

    3 org.chromium.ContentShell.framework 0 x 05855511 0x4d58000 + 11523345

    4 libsystem_pthread.dylib 0x96895e13 _pthread_body + 138

    5 libsystem_pthread.dylib 0x96895d89 _pthread_start + 162

    6 libsystem_pthread.dylib 0x96893e52 thread_start + 34

    Line 13: Chrome_DBThread

    0 libsystem_kernel.dylib 0x9be9d9ce mach_msg_trap + 10

    1 libsystem_kernel.dylib 0x9be9ca70 mach_msg + 68

    2 com.apple.CoreFoundation 0x9980def6 __CFRunLoopServiceMachPort + 214

    3 com.apple.CoreFoundation 0x9980d309 __CFRunLoopRun + 1529

    4 com.apple.CoreFoundation 0x9980caa6 CFRunLoopRunSpecific + 390

    5 com.apple.CoreFoundation 0x9980c90b CFRunLoopRunInMode + 123

    6 org.chromium.ContentShell.framework 0x04e5ae6d 0x4d58000 + 1060461

    7 org.chromium.ContentShell.framework 0x04e5aa6c 0x4d58000 + 1059436

    8 org.chromium.ContentShell.framework 0x04e9fc81 0x4d58000 + 1342593

    org.chromium.ContentShell.framework 9 0x04eb457f 0x4d58000 + 1426815

    10 org.chromium.ContentShell.framework 0x04e9fa2a 0x4d58000 + 1341994

    11 org.chromium.ContentShell.framework 0x04ecaeb1 0x4d58000 + 1519281

    12 org.chromium.ContentShell.framework 0 x 07209799 0x4d58000 + 38475673

    13 org.chromium.ContentShell.framework 0x04ecafa2 0x4d58000 + 1519522

    14 org.chromium.ContentShell.framework 0x04ec68c5 0x4d58000 + 1501381

    15 libsystem_pthread.dylib 0x96895e13 _pthread_body + 138

    16 libsystem_pthread.dylib 0x96895d89 _pthread_start + 162

    17 libsystem_pthread.dylib 0x96893e52 thread_start + 34

    Thread 14: Chrome_FileThread

    0 libsystem_kernel.dylib 0x9bea48b2 kevent + 10

    1 org.chromium.ContentShell.framework 0x04edc0eb 0x4d58000 + 1589483

    2 org.chromium.ContentShell.framework 0x04ed9ceb 0x4d58000 + 1580267

    3 org.chromium.ContentShell.framework 0x04e59ef8 0x4d58000 + 1056504

    4 org.chromium.ContentShell.framework 0x04e9fc81 0x4d58000 + 1342593

    5 org.chromium.ContentShell.framework 0x04eb457f 0x4d58000 + 1426815

    6 org.chromium.ContentShell.framework 0x04e9fa2a 0x4d58000 + 1341994

    7 org.chromium.ContentShell.framework 0x04ecaeb1 0x4d58000 + 1519281

    8 org.chromium.ContentShell.framework 0 x 07209829 0x4d58000 + 38475817

    org.chromium.ContentShell.framework 9 0x04ecafa2 0x4d58000 + 1519522

    10 org.chromium.ContentShell.framework 0x04ec68c5 0x4d58000 + 1501381

    11 libsystem_pthread.dylib 0x96895e13 _pthread_body + 138

    12 libsystem_pthread.dylib 0x96895d89 _pthread_start + 162

    13 libsystem_pthread.dylib 0x96893e52 thread_start + 34

    15 phone: Chrome_FileUserBlockingThread

    0 libsystem_kernel.dylib 0x9be9d9ce mach_msg_trap + 10

    1 libsystem_kernel.dylib 0x9be9ca70 mach_msg + 68

    2 com.apple.CoreFoundation 0x9980def6 __CFRunLoopServiceMachPort + 214

    3 com.apple.CoreFoundation 0x9980d309 __CFRunLoopRun + 1529

    4 com.apple.CoreFoundation 0x9980caa6 CFRunLoopRunSpecific + 390

    5 com.apple.CoreFoundation 0x9980c90b CFRunLoopRunInMode + 123

    6 org.chromium.ContentShell.framework 0x04e5ae6d 0x4d58000 + 1060461

    7 org.chromium.ContentShell.framework 0x04e5aa6c 0x4d58000 + 1059436

    8 org.chromium.ContentShell.framework 0x04e9fc81 0x4d58000 + 1342593

    org.chromium.ContentShell.framework 9 0x04eb457f 0x4d58000 + 1426815

    10 org.chromium.ContentShell.framework 0x04e9fa2a 0x4d58000 + 1341994

    11 org.chromium.ContentShell.framework 0x04ecaeb1 0x4d58000 + 1519281

    12 org.chromium.ContentShell.framework 0x072098b9 0x4d58000 + 38475961

    13 org.chromium.ContentShell.framework 0x04ecafa2 0x4d58000 + 1519522

    14 org.chromium.ContentShell.framework 0x04ec68c5 0x4d58000 + 1501381

    15 libsystem_pthread.dylib 0x96895e13 _pthread_body + 138

    16 libsystem_pthread.dylib 0x96895d89 _pthread_start + 162

    17 libsystem_pthread.dylib 0x96893e52 thread_start + 34

    16 wire: Chrome_ProcessLauncherThread

    0 libsystem_kernel.dylib 0x9be9d9ce mach_msg_trap + 10

    1 libsystem_kernel.dylib 0x9be9ca70 mach_msg + 68

    2 com.apple.CoreFoundation 0x9980def6 __CFRunLoopServiceMachPort + 214

    3 com.apple.CoreFoundation 0x9980d309 __CFRunLoopRun + 1529

    4 com.apple.CoreFoundation 0x9980caa6 CFRunLoopRunSpecific + 390

    5 com.apple.CoreFoundation 0x9980c90b CFRunLoopRunInMode + 123

    6 org.chromium.ContentShell.framework 0x04e5ae6d 0x4d58000 + 1060461

    7 org.chromium.ContentShell.framework 0x04e5aa6c 0x4d58000 + 1059436

    8 org.chromium.ContentShell.framework 0x04e9fc81 0x4d58000 + 1342593

    org.chromium.ContentShell.framework 9 0x04eb457f 0x4d58000 + 1426815

    10 org.chromium.ContentShell.framework 0x04e9fa2a 0x4d58000 + 1341994

    11 org.chromium.ContentShell.framework 0x04ecaeb1 0x4d58000 + 1519281

    12 org.chromium.ContentShell.framework 0 x 07209949 0x4d58000 + 38476105

    13 org.chromium.ContentShell.framework 0x04ecafa2 0x4d58000 + 1519522

    14 org.chromium.ContentShell.framework 0x04ec68c5 0x4d58000 + 1501381

    15 libsystem_pthread.dylib 0x96895e13 _pthread_body + 138

    16 libsystem_pthread.dylib 0x96895d89 _pthread_start + 162

    17 libsystem_pthread.dylib 0x96893e52 thread_start + 34

    Thread 17: Chrome_CacheThread

    0 libsystem_kernel.dylib 0x9bea48b2 kevent + 10

    1 org.chromium.ContentShell.framework 0x04edc0eb 0x4d58000 + 1589483

    2 org.chromium.ContentShell.framework 0x04ed9ceb 0x4d58000 + 1580267

    3 org.chromium.ContentShell.framework 0x04e59f15 0x4d58000 + 1056533

    4 org.chromium.ContentShell.framework 0x04e9fc81 0x4d58000 + 1342593

    5 org.chromium.ContentShell.framework 0x04eb457f 0x4d58000 + 1426815

    6 org.chromium.ContentShell.framework 0x04e9fa2a 0x4d58000 + 1341994

    7 org.chromium.ContentShell.framework 0x04ecaeb1 0x4d58000 + 1519281

    8 org.chromium.ContentShell.framework 0x072099d9 0x4d58000 + 38476249

    org.chromium.ContentShell.framework 9 0x04ecafa2 0x4d58000 + 1519522

    10 org.chromium.ContentShell.framework 0x04ec68c5 0x4d58000 + 1501381

    11 libsystem_pthread.dylib 0x96895e13 _pthread_body + 138

    12 libsystem_pthread.dylib 0x96895d89 _pthread_start + 162

    13 libsystem_pthread.dylib 0x96893e52 thread_start + 34

    18 wire: Chrome_IOThread

    0 libsystem_kernel.dylib 0x9bea48b2 kevent + 10

    1 org.chromium.ContentShell.framework 0x04edc0eb 0x4d58000 + 1589483

    2 org.chromium.ContentShell.framework 0x04ed9ceb 0x4d58000 + 1580267

    3 org.chromium.ContentShell.framework 0x04e59ef8 0x4d58000 + 1056504

    4 org.chromium.ContentShell.framework 0x04e9fc81 0x4d58000 + 1342593

    5 org.chromium.ContentShell.framework 0x04eb457f 0x4d58000 + 1426815

    6 org.chromium.ContentShell.framework 0x04e9fa2a 0x4d58000 + 1341994

    7 org.chromium.ContentShell.framework 0x04ecaeb1 0x4d58000 + 1519281

    8 org.chromium.ContentShell.framework 0x07209a69 0x4d58000 + 38476393

    org.chromium.ContentShell.framework 9 0x04ecafa2 0x4d58000 + 1519522

    10 org.chromium.ContentShell.framework 0x04ec68c5 0x4d58000 + 1501381

    11 libsystem_pthread.dylib 0x96895e13 _pthread_body + 138

    12 libsystem_pthread.dylib 0x96895d89 _pthread_start + 162

    13 libsystem_pthread.dylib 0x96893e52 thread_start + 34

    Thread 19: IndexedDB

    0 libsystem_kernel.dylib 0x9be9d9ce mach_msg_trap + 10

    1 libsystem_kernel.dylib 0x9be9ca70 mach_msg + 68

    2 com.apple.CoreFoundation 0x9980def6 __CFRunLoopServiceMachPort + 214

    3 com.apple.CoreFoundation 0x9980d309 __CFRunLoopRun + 1529

    4 com.apple.CoreFoundation 0x9980caa6 CFRunLoopRunSpecific + 390

    5 com.apple.CoreFoundation 0x9980c90b CFRunLoopRunInMode + 123

    6 org.chromium.ContentShell.framework 0x04e5ae6d 0x4d58000 + 1060461

    7 org.chromium.ContentShell.framework 0x04e5aa6c 0x4d58000 + 1059436

    8 org.chromium.ContentShell.framework 0x04e9fc81 0x4d58000 + 1342593

    org.chromium.ContentShell.framework 9 0x04eb457f 0x4d58000 + 1426815

    10 org.chromium.ContentShell.framework 0x04e9fa2a 0x4d58000 + 1341994

    11 org.chromium.ContentShell.framework 0x04ecaeb1 0x4d58000 + 1519281

    12 org.chromium.ContentShell.framework 0x04ecafa2 0x4d58000 + 1519522

    13 org.chromium.ContentShell.framework 0x04ec68c5 0x4d58000 + 1501381

    14 libsystem_pthread.dylib 0x96895e13 _pthread_body + 138

    15 libsystem_pthread.dylib 0x96895d89 _pthread_start + 162

    16 libsystem_pthread.dylib 0x96893e52 thread_start + 34

    20 phone: NetworkConfigWatcher

    0 libsystem_kernel.dylib 0x9be9d9ce mach_msg_trap + 10

    1 libsystem_kernel.dylib 0x9be9ca70 mach_msg + 68

    2 com.apple.CoreFoundation 0x9980def6 __CFRunLoopServiceMachPort + 214

    3 com.apple.CoreFoundation 0x9980d309 __CFRunLoopRun + 1529

    4 com.apple.CoreFoundation 0x9980caa6 CFRunLoopRunSpecific + 390

    5 com.apple.CoreFoundation 0x9980c90b CFRunLoopRunInMode + 123

    6 com.apple.Foundation 0x9062834a-[NSRunLoop (NSRunLoop) runMode:beforeDate:] + 305

    7 org.chromium.ContentShell.framework 0x04e5b11f 0x4d58000 + 1061151

    8 org.chromium.ContentShell.framework 0x04e5aa6c 0x4d58000 + 1059436

    org.chromium.ContentShell.framework 9 0x04e9fc81 0x4d58000 + 1342593

    10 org.chromium.ContentShell.framework 0x04eb457f 0x4d58000 + 1426815

    11 org.chromium.ContentShell.framework 0x04e9fa2a 0x4d58000 + 1341994

    12 org.chromium.ContentShell.framework 0x04ecaeb1 0x4d58000 + 1519281

    13 org.chromium.ContentShell.framework 0x04ecafa2 0x4d58000 + 1519522

    14 org.chromium.ContentShell.framework 0x04ec68c5 0x4d58000 + 1501381

    15 libsystem_pthread.dylib 0x96895e13 _pthread_body + 138

    16 libsystem_pthread.dylib 0x96895d89 _pthread_start + 162

    17 libsystem_pthread.dylib 0x96893e52 thread_start + 34

    Line 21: AudioThread

    0 libsystem_kernel.dylib 0x9be9d9ce mach_msg_trap + 10

    1 libsystem_kernel.dylib 0x9be9ca70 mach_msg + 68

    2 com.apple.CoreFoundation 0x9980def6 __CFRunLoopServiceMachPort + 214

    3 com.apple.CoreFoundation 0x9980d309 __CFRunLoopRun + 1529

    4 com.apple.CoreFoundation 0x9980caa6 CFRunLoopRunSpecific + 390

    5 com.apple.CoreFoundation 0x9980c90b CFRunLoopRunInMode + 123

    6 org.chromium.ContentShell.framework 0x04e5ae6d 0x4d58000 + 1060461

    7 org.chromium.ContentShell.framework 0x04e5aa6c 0x4d58000 + 1059436

    8 org.chromium.ContentShell.framework 0x04e9fc81 0x4d58000 + 1342593

    org.chromium.ContentShell.framework 9 0x04eb457f 0x4d58000 + 1426815

    10 org.chromium.ContentShell.framework 0x04e9fa2a 0x4d58000 + 1341994

    11 org.chromium.ContentShell.framework 0x04ecaeb1 0x4d58000 + 1519281

    12 org.chromium.ContentShell.framework 0x04ecafa2 0x4d58000 + 1519522

    13 org.chromium.ContentShell.framework 0x04ec68c5 0x4d58000 + 1501381

    14 libsystem_pthread.dylib 0x96895e13 _pthread_body + 138

    15 libsystem_pthread.dylib 0x96895d89 _pthread_start + 162

    16 libsystem_pthread.dylib 0x96893e52 thread_start + 34

    Thread 22: BrowserBlockingWorker1/52995

    0 libsystem_kernel.dylib 0x9bea3512 __psynch_cvwait + 10

    1 libsystem_pthread.dylib 0x96896a4a _pthread_cond_wait + 726

    pthread_cond_wait 2 libsystem_pthread.dylib 0x9689a1c0 $UNIX2003 + 71

    3 org.chromium.ContentShell.framework 0x04ec20e8 0x4d58000 + 1482984

    4 org.chromium.ContentShell.framework 0x04ec7bd9 0x4d58000 + 1506265

    5 org.chromium.ContentShell.framework 0x04ec7183 0x4d58000 + 1503619

    6 org.chromium.ContentShell.framework 0x04eca623 0x4d58000 + 1517091

    7 org.chromium.ContentShell.framework 0x04ec68c5 0x4d58000 + 1501381

    8 libsystem_pthread.dylib 0x96895e13 _pthread_body + 138

    libsystem_pthread.dylib 9 0x96895d89 _pthread_start + 162

    10 libsystem_pthread.dylib 0x96893e52 thread_start + 34

    Line 23:

    0 libsystem_kernel.dylib 0x9be9d9ce mach_msg_trap + 10

    1 libsystem_kernel.dylib 0x9be9ca70 mach_msg + 68

    2 org.chromium.ContentShell.framework 0 x 07357890 0x4d58000 + 39843984

    3 org.chromium.ContentShell.framework 0x04ec68c5 0x4d58000 + 1501381

    4 libsystem_pthread.dylib 0x96895e13 _pthread_body + 138

    5 libsystem_pthread.dylib 0x96895d89 _pthread_start + 162

    6 libsystem_pthread.dylib 0x96893e52 thread_start + 34

    Thread 24: Proxy resolver

    0 libsystem_kernel.dylib 0x9be9d9ce mach_msg_trap + 10

    1 libsystem_kernel.dylib 0x9be9ca70 mach_msg + 68

    2 com.apple.CoreFoundation 0x9980def6 __CFRunLoopServiceMachPort + 214

    3 com.apple.CoreFoundation 0x9980d309 __CFRunLoopRun + 1529

    4 com.apple.CoreFoundation 0x9980caa6 CFRunLoopRunSpecific + 390

    5 com.apple.CoreFoundation 0x9980c90b CFRunLoopRunInMode + 123

    6 org.chromium.ContentShell.framework 0x04e5ae6d 0x4d58000 + 1060461

    7 org.chromium.ContentShell.framework 0x04e5aa6c 0x4d58000 + 1059436

    8 org.chromium.ContentShell.framework 0x04e9fc81 0x4d58000 + 1342593

    org.chromium.ContentShell.framework 9 0x04eb457f 0x4d58000 + 1426815

    10 org.chromium.ContentShell.framework 0x04e9fa2a 0x4d58000 + 1341994

    11 org.chromium.ContentShell.framework 0x04ecaeb1 0x4d58000 + 1519281

    12 org.chromium.ContentShell.framework 0x04ecafa2 0x4d58000 + 1519522

    13 org.chromium.ContentShell.framework 0x04ec68c5 0x4d58000 + 1501381

    14 libsystem_pthread.dylib 0x96895e13 _pthread_body + 138

    15 libsystem_pthread.dylib 0x96895d89 _pthread_start + 162

    16 libsystem_pthread.dylib 0x96893e52 thread_start + 34

    Line 25:

    0 com.apple.security 0x99eaa31a security: Mutex::tryLock() + 38

    1 com.apple.security 0x99eaa2ec attachment: tryLock() + 20

    2 com.apple.security 0x99eb1a75 StandardAttachment < 4u, cssm_spi_dl_funcs > & Security::MappingHandle < long >: findAndLock < StandardAttachment < 4u, cssm_spi_dl_funcs > >(long, int) + 139

    3 com.apple.security 0x99eb7060 CSSM_DL_DataGetNext + 28

    4 com.apple.security 0x99eb2b94 Security::CssmClient:DbDbCursorImpl:next(Security::CssmClient::DbAttributes*,_Security::CssmDataContainer*,_Security::CssmClient::DbUniqueRecord&) + 290

    5 com.apple.security 0x99f6186f Security::CssmClient:SSDbCursorImpl:next(Security::CssmClient::DbAttributes*,_Security::CssmDataContainer*,_Security::CssmClient::DbUniqueRecord&,_cssm_access_credentials_const*) + 363

    6 com.apple.security 0x99eb66c7 Security::CssmClient:SSDbCursorImpl:next(Security::CssmClient::DbAttributes*,_Security::CssmDataContainer*,_Security::CssmClient::DbUniqueRecord&) + 47

    7 com.apple.security 0x99eb5dbe Security::KeychainCore:KeychainSchemaImpl:KeychainSchemaImpl(Security::CssmClient::Db_const&) + 394

    8 com.apple.security 0x99eb5c0b Security::KeychainCore:KeychainSchema:KeychainSchema(Security::CssmClient::Db_const&) + 37

    9 com.apple.security 0x99eb5b69 security: KeychainCore::KeychainImpl::keychainSchema() + 73

    10 com.apple.security 0x99eb55cc Security::KeychainCore:DefaultCredentials:operator ((Security::CssmClient:Db)) + 66

    11 com.apple.security 0x99eb540b security: KeychainCore::KeychainImpl::defaultCredentials() + 211

    12 com.apple.security 0x99fd12a2 non virtual thunk of security: KeychainCore::KeychainImpl::makeCredentials() + 20

    13 com.apple.security 0x99eb0bbc security: CssmClient::DbImpl::open() + 282

    2014 + 14 com.apple.security 0x99ec968e Security::KeychainCore:Trust:evaluate (bool)

    15 com.apple.security 0x99ec8d1b SecTrustEvaluate + 44

    16 com.apple.security 0x99f21859 decodeTimeStampTokenWithPolicy + 1986

    17 com.apple.security 0x99f1e68a SecCmsSignerInfoVerifyUnAuthAttrsWithPolicy + 104

    18 com.apple.security 0x99f1e468 SecCmsSignerInfoVerifyWithPolicy + 246

    19 com.apple.security 0x99f1d347 SecCmsSignedDataVerifySignerInfo + 137

    20 com.apple.security 0x99f6a1d3 CMSDecoderCopySignerStatus + 165

    21 com.apple.security 0x99f7c157 security: CodeSigning::SecStaticCode::verifySignature() + 457

    22 com.apple.security 0x99f7be64 security: CodeSigning::SecStaticCode::validateDirectory() + 60

    23 com.apple.security 0x99f7ecdc Security::CodeSigning:SecStaticCode:getDictionary(unsigned_int,_bool) + 30

    24 com.apple.security 0x99f7d3b2 Security::CodeSigning:SecStaticCode:resourceDictionary (bool) + 56

    25 com.apple.security 0x99f7d339 security:::SecStaticCode::estimateResourceWorkload() + 33 CodeSigning

    26 com.apple.security 0x99f7f148 Security::CodeSigning:SecStaticCode:staticValidate(unsigned_int,_Security::CodeSigning::SecRequirement_const*) + 32

    27 com.apple.security 0x99f75c9e SecStaticCodeCheckValidityWithErrors + 342

    28 com.apple.security 0x99f75b43 SecStaticCodeCheckValidity + 39

    29 com.apple.LaunchServices 0x96387e47 _LSAddEntitlementsToDictionary (const __CFURL *, __CFDictionary *) + 171

    30 com.apple.LaunchServices 0x963f5a16 _LSRegisterDirectoryNode (LSContext *, FSNode *, FSNode *, LSRegistrationInfo *, __CFData const *, const __CFDictionary *, __CFArray *, unsigned char *, unsigned long *) + 1634

    31 com.apple.LaunchServices 0x963f6ebe _LSRegisterBundleNode (LSContext *, unsigned long, FSNode *, FSNode *, unsigned long, const __CFDictionary *, __CFArray *, unsigned char *, unsigned long *) + 1246

    32 com.apple.LaunchServices 0x9635324b _LSFindOrRegisterBundleNode + 2000

    33 com.apple.LaunchServices 0x96352eb4 _LSFindOrRegisterBundleNode + 1081

    34 com.apple.LaunchServices 0x963783c1 _LSOpenStuffCallLocal + 690

    35 com.apple.LaunchServices 0 x 96369737 _LSOpenStuff + 107

    36 com.apple.LaunchServices 0 x 96369679 _LSOpenApplication_Common (LSApplicationParameters_V1 const *, const AEKeyDesc *, ProcessSerialNumber *, FSRef *) + 197

    37 com.apple.LaunchServices 0x963d6f8e LSOpenApplication + 39

    38 com.adobe.acc.ContainerUI 0x03cd12f6 + 1718

    39 com.adobe.acc.ContainerUI 0x03c91dc9 ApplicationContext::launchADSExecutableHelper() + 777

    40 com.adobe.acc.ContainerUI 0x03c91948 ApplicationContext::launchADSExecutable(bool const&) + 664

    41 com.adobe.acc.ContainerUI 0x03c92c1a::launchADSIfNotRunning() + 314 ApplicationContext

    42 com.adobe.acc.ContainerUI 0x03c86541 0x3c12000 + 476481

    0x03ce83b0 threadProcHandlerMac(void*) + 48 43 com.adobe.acc.ContainerUI

    44 libsystem_pthread.dylib 0x96895e13 _pthread_body + 138

    45 libsystem_pthread.dylib 0x96895d89 _pthread_start + 162

    46 libsystem_pthread.dylib 0x96893e52 thread_start + 34

    Line 26: com.apple.NSURLConnectionLoader

    0 libsystem_kernel.dylib 0x9be9d9ce mach_msg_trap + 10

    1 libsystem_kernel.dylib 0x9be9ca70 mach_msg + 68

    2 com.apple.CoreFoundation 0x9980def6 __CFRunLoopServiceMachPort + 214

    3 com.apple.CoreFoundation 0x9980d309 __CFRunLoopRun + 1529

    4 com.apple.CoreFoundation 0x9980caa6 CFRunLoopRunSpecific + 390

    5 com.apple.CoreFoundation 0x9980c90b CFRunLoopRunInMode + 123

    6 com.apple.CFNetwork 0x955dcbdf + [NSURLConnection (Loader) _resourceLoadLoop:] + 717

    7 com.apple.Foundation 0x905d0aed-[NSThread main] + 45

    8 com.apple.Foundation 0x905d0896 __NSThread__main__ + 1538

    libsystem_pthread.dylib 9 0x96895e13 _pthread_body + 138

    10 libsystem_pthread.dylib 0x96895d89 _pthread_start + 162

    11 libsystem_pthread.dylib 0x96893e52 thread_start + 34

    Thread 0 crashed with X 86 Thread State (32-bit):

    EAX: 0x7c267560 ebx: 0x7d926010 ecx: 0x953f5242 edx: 0x77c26708

    EDI: 0x7b130000 esi: 0x953daf99 ebp: 0xbff9dde8 esp: 0xbff9dba8

    SS: 0 x 00000023 efl: 0 x 00010206 eip: 0x953d60a7 cs: 0x0000001b

    DS: 0 x 00000023 are: 0 x 00000023 fs: 0 x 00000000 gs: 0x0000000f

    CR2: 0x77c26728

    Logical CPU: 1

    Error code: 0 x 00000004

    Trap number: 14

    Binary images:

    0 x 62000 - 0xe1ff7 + com.adobe.acc.AdobeCreativeCloud (3.6.0.248 - 3.6) < A4D5AD7A-734E-3875-9E60-D2E3F78117AE >/Applications/Utilities/Adobe Creative cloud / * / Creative Cloud.app/Contents/MacOS/Creative Cloud

    0 x 101000 - 0x103fff + com.adobe.AdobeCrashReporter (7.3 - 7.3.2) < 30D7A698-46B5-3227-A764-FE9420AA6D5D >/Applications/Utilities/Adobe Creative cloud / * / Creative Cloud.app/Contents/Frameworks/AdobeCrashReporter.framework/Versions/A/AdobeCrashReporter

    0 x 214000 - 0x29bfff + Core.dylib (3.6.0.248 - 3.6.0.248) < 40D137A2-0211-35D7-BB84-8A86A2E94C67 >/Library/Application Support/Adobe/*/Core.dylib

    0x1a1e000 - 0x1a9fff7 com.apple.xquery (1.3.1 - 30) < 6B4EF9B6-DF7B-3A1A-8C60-2419453F0BFE > /System/Library/PrivateFrameworks/XQuery.framework/XQuery

    0x1b2c000 - 0x1d3eff3 + AdobePIM.dylib (3.6.0.248 - 3.6.0.248) < F72B3B31-00F4-3525-9090-2C6AE1E36648 >/Library/Application Support/Adobe/*/AdobePIM.dylib

    0x1d61000 - 0x1dd4fff + CmdCntr.dylib (3.6.0.248 - 3.6.0.248) < 8C1900D1-DBA1-3D29-B88E-A93FD13BF501 >/Library/Application Support/Adobe/*/CmdCntr.dylib

    0x1dff000 - 0x1e56ff3 + VulcanWrapper.dylib (3.6.0.248 - 3.6.0.248) < 8F9DF39F-0B39-3AB0-A51F-74F45AA138C4 >/Library/Application Support/Adobe/*/VulcanWrapper.dylib

    0x1e7e000 - 0x1eb1ff3 + VulcanMessage5.dylib (5.2.0.35 - 5.2.0.35 copyright 2015, Adobe Systems Incorporated.) (All rights reserved). < 194472A5-9831-37FD-8DA0-588C5DBB629C >/Library/Application Support/Adobe/*/VulcanMessage5.dylib

    0x1eeb000 - 0x1f09ff7 + VulcanControl.dylib (5.2.0.39 - 5.2.0.39 copyright 2015, Adobe Systems Incorporated.) (All rights reserved). < 2D7737D8-74F0-3239-B7F5-27FADADD2A7B >/Library/Application Support/Adobe/*/VulcanControl.dylib

    0x1f4f000 - 0x1fdfff3 + LocManager.dylib (3.6.0.248 - 3.6.0.248) < 254808D2-3AAA-30DA-8C16-9783CF75DC8B >/Library/Application Support/Adobe/*/LocManager.dylib

    0 x 2006000 - 0x209dff7 + Analytics.dylib (3.6.0.248 - 3.6.0.248) < 58AF2473-A71A-3106-9E7A-7351391B2A33 >/Library/Application Support/Adobe/*/Analytics.dylib

    0 x 2385000 - 0x245efff + HEX.dylib (3.6.0.248 - 3.6.0.248) < 658ADA2C-FC67-3A0C-8A84-319721450EA3 >/Library/Application Support/Adobe/*/HEX.dylib

    0 x 2497000 - 0x24d0ff7 com.apple.audio.midi.CoreMIDI /System/Library/Frameworks/CoreMIDI.framework/Versions/A/CoreMIDI < 20E11181-3421-3D46-97C0-347F68ED816A > (1.10 - 88)

    0x24f3000 - 0x250affb libexpat.1.dylib (12) < 751B1CA1-D871-37AA-BE43-4131FF8B7747 > /usr/lib/libexpat.1.dylib

    0x27c5000 - 0x2a1afe3 + PrefsManager.dylib (3.6.0.248 - 3.6.0.248) < 83B6A050-F4EB-3953-B8F0-53E7D96387DE >/Library/Application Support/Adobe/*/PrefsManager.dylib

    0x3b93000 - 0x3be0fff com.apple.CloudDocs (1.0 - 321, 6) < EF208D9F-9E6C-3FF9-AC82-3C2B4EBFAB89 > /System/Library/PrivateFrameworks/CloudDocs.framework/CloudDocs

    0x3c12000 - 0x3d62ff3 + com.adobe.acc.ContainerUI (3.6.0.248 - 3.6.0.248) < CAE272A0-C66B-30B1-9092-F5905CD0F9E2 > Applications/Utilities/Adobe Creative Cloud/*/ContainerUI.bundle/Contents/MacOS/ContainerUI

    0 x 4440000 - 0x4441ffb + com.cooliris.safariplugin (Cooliris Plugin - 1.11) < D819245D-DCC5-E405-2267-197D6CC7D73C > /Library/InputManagers/*/Cooliris.bundle/Contents/MacOS/Cooliris

    0x4d58000 - 0x7f68f8b + org.chromium.ContentShell.framework (39.0.2171.95 - 2171.95) < DED436B1-7C72-3551-B784-5C089EE26FC6 > / Library/Application Support/Adobe / * / chrome Chromium-Framework.framework/Embedded embedded framework

    0x8fe60000 - 0x8fe93e03 dyld (353.2.1) < 06B1254D-9BB9-327C-BA15-8F18FFF97586 >/usr/lib/dyld

    0x9003d000 - 0x90054ff7 com.apple.CoreMediaAuthoring (2.2 - 951) < C1019289-9E99-39A2-9580-6C2FCAE9B666 > /System/Library/PrivateFrameworks/CoreMediaAuthoring.framework/Versions/A/CoreMediaAuthor ing

    0 x 90055000 - 0x90057ffb (779.11) libCGXType.A.dylib < 2B22C4C3-CF75-3909-B9A0-1B9A23028FBB > /System/Library/Frameworks/CoreGraphics.framework/Versions/A/Resources/libCGXType.A.dylib

    0 x 90149000 - 0x901c0fff com.apple.ApplicationServices.ATS (360-375, 2) < A5CA2D71-673F-3FD8-B515-DAB1B3CC52C5 > /System/Library/Frameworks/ApplicationServices.framework/Versions/A/Frameworks/ATS.framew ork/Versions/A/ATS

    0x901c1000 - 0x901f0fff com.apple.CoreVideo (1, 8 - 145.1) < A59466FC-6B5A-3B36-BDD4-AC9CD581B7A1 > /System/Library/Frameworks/CoreVideo.framework/Versions/A/CoreVideo

    0x903a0000 - 0x90427fff com.apple.CoreServices.OSServices (640, 4-640, 4) < 6ABC3CCE-5A4E-3CB2-AA12-3FFAB27D835A > /System/Library/Frameworks/CoreServices.framework/Versions/A/Frameworks/OSServices.framew ork/Versions/A/OSServices

    90452000 - 0x90457fff com.apple.print.framework.Print 0 x (10.0 - 265) < 7C3984BB-8337-3B90-A414-17C181A45744 > /System/Library/Frameworks/Carbon.framework/Versions/A/Frameworks/Print.framework/Version s/A/Print

    0 x 90458000 - 0x9045eff3 libsystem_platform.dylib (63) < 509993B7-3F26-3360-B899-0BBB15152516 > /usr/lib/system/libsystem_platform.dylib

    0x9045f000 - 0x90465ff7 (72.20.1) libsystem_trace.dylib < 5F23BE77-1C60-3859-B528-C6B3C184C95C > /usr/lib/system/libsystem_trace.dylib

    0 x 90466000 - 0x90466fff com.apple.CoreServices /System/Library/Frameworks/CoreServices.framework/Versions/A/CoreServices < 08A581EC-2E8B-30CF-B555-64171C8FE5EE > (62-62)

    0 x 90467000 - 0x9058dffb com.apple.WebKitLegacy (10600 - 10600.5.17) /System/Library/Frameworks/WebKit.framework/Versions/A/Frameworks/WebKitLegacy.framework/ < DAB0FB97-294B-339C-B986-2711E5EB5F4F > Versions/A/WebKitLegacy

    0x9058e000 - 0x908efff3 com.apple.Foundation /System/Library/Frameworks/Foundation.framework/Versions/C/Foundation < B2539D54-EC35-3388-82C7-B01BB225A804 > (6, 9 - 1153.20)

    0x908f0000 - 0x90943fff libstdc ++.6.dylib (104.1) < D0EB2C99-5939-3ABA-9C18-D9AD75CE23A1 > /usr/lib/libstdc++.6.dylib

    0 x 90944000 - 0x9099ffff com.apple.LanguageModeling (< 9B39E059-F48E-31AF-B1B3-B0872F362627 > /System/Library/PrivateFrameworks/LanguageModeling.framework/Versions/A/LanguageModeling 1.0 - 1.).

    0x909a0000 - 0x909c6ff3 (559.20.9) libxpc.dylib < 15931AC6-7282-332D-9A44-6CFF84AC63AF > /usr/lib/system/libxpc.dylib

    0x90b78000 - 0x90b85ff7 libbz2.1.0.dylib (36) < 6BC7B049-8F03-3217-9840-B1804CCBF742 > /usr/lib/libbz2.1.0.dylib

    0x90c15000 - 0x90c1dfff (561.1.1) libsystem_dnssd.dylib < 45CDAF46-03DE-33DB-A627-14F245993EF2 > /usr/lib/system/libsystem_dnssd.dylib

    0x90c1e000 - 0x91bd7ff3 com.apple.WebCore (10600 - 10600.5.17) < 1AB2AC41-CFB5-3848-97FF-8ABC4C6B476C > /System/Library/Frameworks/WebKit.framework/Versions/A/Frameworks/WebCore.framework/Versi ons/A/WebCore

    0x91bd8000 - 0x91bd8fff com.apple.Accelerate.vecLib (vecLib - 3.10 3.10) < F968D12F-F59D-3148-951D-76735C3C1B57 > /System/Library/Frameworks/Accelerate.framework/Versions/A/Frameworks/vecLib.framework/Ve rsions/A/vecLib

    0x91bd9000 - 0x92139ff3 com.apple.MediaToolbox /System/Library/Frameworks/MediaToolbox.framework/Versions/A/MediaToolbox < 44C382D2-F7B2-312A-B6CC-AD27D0F17011 > (1.0 - 1562.235)

    0x921f4000 - 0x922bffff com.apple.backup.framework (1.6.4 - 1.6.4) < 75DC1CA0-5D18-3E8F-A8BC-D737FC9C55C4 > /System/Library/PrivateFrameworks/Backup.framework/Versions/A/Backup

    0x922c0000 - 0x923b6ff7 libxml2.2.dylib (26) < 2F37833C-4D55-3A09-9A0C-5904E8B6892A > /usr/lib/libxml2.2.dylib

    0x923b7000 - 0x9242affb com.apple.framework.CoreWLAN (5.0 - 500.35.2) /System/Library/Frameworks/CoreWLAN.framework/Versions/A/CoreWLAN < 8D5F7007-D938-3A4D-841A-647D272D2DB6 >

    0x9242b000 - 0x9242cfff com.apple.TrustEvaluationAgent (2.0 - 25) < 28BBD931-EF7C-3753-B50E-6568F4075086 > /System/Library/PrivateFrameworks/TrustEvaluationAgent.framework/Versions/A/TrustEvaluati onAgent

    0x92d3b000 - 0x92d42fff com.apple.speech.recognition.framework (5.0.9 - 5.0.9) < 5D268178-3812-3777-92A6-D7D3395405B8 > work/Versions/A/SpeechRecognition /System/Library/Frameworks/Carbon.framework/Versions/A/Frameworks/SpeechRecognition.frame

    0x92d43000 - 0x92db9ff7 com.apple.SearchKit (1.4.0 - 1.4.0) < 3693A221-B615-37D4-9FB1-F5F6CC7EE1A7 > /System/Library/Frameworks/CoreServices.framework/Versions/A/Frameworks/SearchKit.framewo rk/Versions/A/SearchKit

    0x92dba000 - 0x939e6fff com.apple.AppKit /System/Library/Frameworks/AppKit.framework/Versions/C/AppKit < 2E995EB6-3DB5-3FE0-B140-3E7563903322 > (6, 9 - 1347.57)

    0x939e7000 - 0x939e7fff com.apple.ApplicationServices /System/Library/Frameworks/ApplicationServices.framework/Versions/A/ApplicationServices < 76C301A4-705B-33DE-BA11-C89DCF1EDCDD > (48-48)

    0x939e8000 - 0x939ebfff (353.2.1) libdyld.dylib < 30CE0D0E-7E82-3CD5-92E7-9C1D6AD3327C > /usr/lib/system/libdyld.dylib

    0x939ec000 - 0x939eeff7 (76.20.1) libquarantine.dylib < 8694AC5A-7359-3CC6-8E93-CABFCC919D4B > /usr/lib/system/libquarantine.dylib

    0x939ef000 - 0x93a2ffff libauto.dylib (186) < 1609D0F9-6E3A-3C67-87EF-BB0BD93EDAC9 > /usr/lib/libauto.dylib

    0x93a30000 - 0x93a4dffb com.apple.Ubiquity /System/Library/PrivateFrameworks/Ubiquity.framework/Versions/A/Ubiquity < 9ED23769-0725-3D4B-B7F4-AF08020D73C3 > (1.3 - 313)

    0x93a4e000 - 0x93a61fff com.apple.Sharing /System/Library/PrivateFrameworks/Sharing.framework/Versions/A/Sharing < 57F64876-D785-3B35-91B9-B2800F800C37 > (328, 16-328, 16)

    0x93a62000 - 0x93a9cfff com.apple.AirPlaySupport /System/Library/PrivateFrameworks/AirPlaySupport.framework/Versions/A/AirPlaySupport < 62CFE5FC-293F-36C8-9371-243892E55D73 > (2.0 - 215.18)

    0x93a9d000 - 0x93aa4fff libMatch.1.dylib (24) < 428CD037-5261-39A6-83EE-A7D9ABF446EB > /usr/lib/libMatch.1.dylib

    0x93aa9000 - 0x93afafff libcups.2.dylib (408,2) < 425E4328-ECA1-31EE-B2C4-0D67FB8848BE > /usr/lib/libcups.2.dylib

    0x93b36000 - 0x93c64ff7 com.apple.coreui (2.1 - 308, 6) < 908A9C21-7AE9-3480-A858-2E4D928F661D > /System/Library/PrivateFrameworks/CoreUI.framework/Versions/A/CoreUI

    0x93c65000 - 0x9410dff7 com.apple.JavaScriptCore (10600 - 10600.5.10) /System/Library/Frameworks/JavaScriptCore.framework/Versions/A/JavaScriptCore < D9054A31-B5A8-363C-90DD-4359ECEBFBFA >

    0x9410e000 - 0x94224fff com.apple.CoreText (352.0 - 454, 6) < 5F236E10-C911-3AAF-8BA6-2F0F68A87443 > /System/Library/Frameworks/CoreText.framework/Versions/A/CoreText

    0 x 94225000 - 0x94229ffb com.apple.IOSurface (97, 4-97, 4) < FD6AD351-BD60-337C-8D3D-42CDA7EE137C > /System/Library/Frameworks/IOSurface.framework/Versions/A/IOSurface

    0 x 94238000 - 0x9426bfe3 (3086.1) libsystem_m.dylib < 951F633F-57B7-398B-912F-F6ED4DB1C597 > /usr/lib/system/libsystem_m.dylib

    0x9426c000 - 0x9455eff3 com.apple.CoreImage (10.3.4) < 6A0E17E6-9F56-3450-8892-670A9C489C30 > /System/Library/Frameworks/QuartzCore.framework/Versions/A/Frameworks/CoreImage.framework/Versions/A/CoreImage

    0x9455f000 - 0x947f6fff com.apple.CoreData (111 - 526.3) < 93295B9D-6C48-3919-8B9C-A4291D3522CE > /System/Library/Frameworks/CoreData.framework/Versions/A/CoreData

    0x947f7000 - 0x947fafff libextension.dylib (55.2) < BE3B5B43-A1BB-3BB6-9CD9-946BC61241FC > /usr/lib/libextension.dylib

    0x947fb000 - 0x9496cffb libBLAS.dylib (1128) < ACEF468C-5DB1-38F3-BCB2-6F3D7F2B2040 > /System/Library/Frameworks/Accelerate.framework/Versions/A/Frameworks/vecLib.framework/Ve rsions/A/libBLAS.dylib

    0x9496d000 - 0x94a1cffb com.apple.Bluetooth (4.3.4 - 4.3.4f4) /System/Library/Frameworks/IOBluetooth.framework/Versions/A/IOBluetooth < 90D495A0-431F-363B-8818-230CB096D6E1 >

    0x94a1d000 - 0x94a2dfff libGL.dylib (11.1.2) < 44DD250B-CB98-3FD1-BF5B-6AD85A68BF9A > /System/Library/Frameworks/OpenGL.framework/Versions/A/Libraries/libGL.dylib

    0x94a2e000 - 0x94a3bff3 com.apple.ProtocolBuffer (1 - 228.0.1) /System/Library/PrivateFrameworks/ProtocolBuffer.framework/Versions/A/ProtocolBuffer < B61B9562-CBDE-34E5-B19E-291A1D95D782 >

    0x94a3c000 - 0x94a63fff (442.1.4) libdispatch.dylib < B26A176C-39F7-3362-B128-27B1211068B9 > /usr/lib/system/libdispatch.dylib

    0x94a64000 - 0x94ab9ff7 com.apple.htmlrendering (77 - 1.1.4) < B85A63B9-C9DD-3ECC-B5DC-E12533C7FDF9 > /System/Library/Frameworks/Carbon.framework/Versions/A/Frameworks/HTMLRendering.framework/Versions/A/HTMLRendering

    0x94aba000 - 0x94ac1ff3 libunwind.dylib (35.3) < 29D9343F-9A0A-3535-B0AE-E7CC761D95EE > /usr/lib/system/libunwind.dylib

    0x94ac2000 - 0x94ad6fff com.apple.ImageCapture (9, 0-9, 0) < 4B84B5D5-A5F3-3B35-93CE-568A73486B92 > /System/Library/Frameworks/Carbon.framework/Versions/A/Frameworks/ImageCapture.framework/ Versions/A/ImageCapture

    0x94ad7000 - 0x94ad8fff libDiagnosticMessagesClient.dylib (100) < 3EE83437-AA9C-356B-810B-589346B73797 > /usr/lib/libDiagnosticMessagesClient.dylib

    0x94ad9000 - 0x94b81ff7 com.apple.CoreMedia /System/Library/Frameworks/CoreMedia.framework/Versions/A/CoreMedia < BA4933F2-289D-354B-B3B7-451AAF9FBB96 > (1.0 - 1562.235)

    0x94b82000 - 0x94b99fff libsystem_asl.dylib (267) < 85BD88AD-618E-3325-AC31-10DBAB8E9AF3 > /usr/lib/system/libsystem_asl.dylib

    0x94ca9000 - 0x94cafff7 (167.1.10) libsystem_networkextension.dylib < FC20E3AD-A53D-3346-AC71-829E82832AE8 > /usr/lib/system/libsystem_networkextension.dylib

    0x94cb0000 - 0x94e38ff7 com.apple.audio.toolbox.AudioToolbox /System/Library/Frameworks/AudioToolbox.framework/Versions/A/AudioToolbox < CA1E6D99-F534-3D3B-9AA5-038E171AD0A9 > (1.12 - 1.12)

    0x94e39000 - 0x94eb8fff com.apple.SystemConfiguration /System/Library/Frameworks/SystemConfiguration.framework/Versions/A/SystemConfiguration < 6081992E-6825-3F69-AACF-70ABFA4CE379 > (1.14 - 1.14)

    0x94eb9000 - 0x94eecfff com.apple.CoreServicesInternal (221.7.2 - 221.7.2) in /System/Library/PrivateFrameworks/CoreServicesInternal.framework/Versions/A/CoreServicesI < 709E9F1B-D266-399B-9A4B-3785BBF64E01 >

    0x94eed000 - 0x94eedfff com.apple.Accelerate (1.10 - 1.10 accelerate) < C2367B5B-AE20-3084-A864-104743BE478E > /System/Library/Frameworks/Accelerate.framework/Versions/A/Accelerate

    0x94eee000 - 0x94ef2ffb libcache.dylib (69) < 55501A00-AF64-3554-8F46-8D5AFEDEC332 > /usr/lib/system/libcache.dylib

    0x94ef3000 - 0x94ef4fff libSystem.B.dylib (1213) < C45CC429-5DE4-3B01-8450-B3BD1AA03C3F > /usr/lib/libSystem.B.dylib

    0x94ef5000 - 0x94fa2fff libcrypto.0.9.7.dylib (106) < 19669D99-DC79-3715-BC3A-850016DDDD7F > /usr/lib/libcrypto.0.9.7.dylib

    0x94fa3000 - 0x94facfff com.apple.DiskArbitration /System/Library/Frameworks/DiskArbitration.framework/Versions/A/DiskArbitration < D906604A-1D8C-31BF-8F22-EA219FFC858F > (2, 6 - 2.6)

    0x94fad000 - 0x94fbcffb libxar.1.dylib (255) < 4FF7DB6F-3232-302F-94BC-F1188F78AF25 > /usr/lib/libxar.1.dylib

    0x94fbd000 - 0x95396ff3 com.apple.HIToolbox (2.1.1 - 758,7) < A7B81A48-6BB9-35EC-B128-D38AD4EC7802 > /System/Library/Frameworks/Carbon.framework/Versions/A/Frameworks/HIToolbox.framework/Ver sions/A/HIToolbox

    0 x 95397000 - 0x953d4fff (412.20.3) libsystem_network.dylib < 039F7709-8BFA-3299-8FD7-168145568642 > /usr/lib/system/libsystem_network.dylib

    0x953d5000 - 0x955c42ef libobjc. A.dylib (647) < 7648C174-3098-3B26-AD20-490DBFFD5D4C >/usr/lib/libobjc. A.dylib

    0x955c5000 - 0x955d2ff7 com.apple.OpenDirectory /System/Library/Frameworks/OpenDirectory.framework/Versions/A/OpenDirectory < 60A9481B-2191-35A2-AB7E-E48A2B49BF09 > (10.10 - 187)

    0x955d3000 - 0x957e1ff7 com.apple.CFNetwork (720.3.13 - 720.3.13) /System/Library/Frameworks/CFNetwork.framework/Versions/A/CFNetwork < 2593580E-5547-37C7-A99A-9D1B086C8B69 >

    0x957e2000 - 0x95ae0ffb com.apple.CoreServices.CarbonCore (1108.6 - 1108.6) < ABEA5906-26AE-308F-B078-5944ABDF94DF > /System/Library/Frameworks/CoreServices.framework/Versions/A/Frameworks/CarbonCore.framew ork/Versions/A/CarbonCore

    0x95ae1000 - 0x95b24fff libGLU.dylib (11.1.2) < D044C93B-4FCF-378E-9CD4-50E2EBA17EF0 > /System/Library/Frameworks/OpenGL.framework/Versions/A/Libraries/libGLU.dylib

    0x95b25000 - 0x95b29ff3 com.apple.TCC (< EE0D6865-A6E0-3BF0-93F1-837C09AA7978 > /System/Library/PrivateFrameworks/TCC.framework/Versions/A/TCC 1.0 - 1.).

    0x95b2a000 - com.apple.DictionaryServices (1.2 - 229) < BC958000-7A7D-3C3A-B0FF-95734A35EB0A > /System/Library/Frameworks/CoreServices.framework/Versions/A/Frameworks/DictionaryService s.framework/Versions/A/DictionaryServices 0x95b59ff7

    0x95b5a000 - 0x95b5efff libheimdal - asn1.dylib (398.10.1) < 6F113AF8-F5AD-330B-B029-F7AF28A93F28 > /usr/lib/libheimdal-asn1.dylib

    0x95b5f000 - 0x95bb5fff libc ++.1.dylib (120) < D8DE4962-66CD-3491-904E-9291EEE5E570 > /usr/lib/libc++.1.dylib

    0x95bb6000 - 0x95c11ffb libTIFF.dylib (1237) < CEE13162-B2D3-3AA6-82A7-AA1A02E424DF > /System/Library/Frameworks/ImageIO.framework/Versions/A/Resources/libTIFF.dylib

    0x95c12000 - 0x95c22ff7 com.apple.LangAnalysis (1.7.0 - 1.7.0) < DBECFAD5-DB53-390C-AE92-09549733C861 > /System/Library/Frameworks/ApplicationServices.framework/Versions/A/Frameworks/LangAnalys is.framework/Versions/A/LangAnalysis

    0x95c23000 - 0x95c4fffb (358.20.5) libsandbox.1.dylib < 5AFB311B-D796-3851-BC5B-72EF603DB2B6 > /usr/lib/libsandbox.1.dylib

    0x95caa000 - 0x95d20fff com.apple.securityfoundation (6.0 - 55126) < 2DB5BDF8-FB04-317B-9A7F-9AC8733947BF > /System/Library/Frameworks/SecurityFoundation.framework/Versions/A/SecurityFoundation

    0x95d21000 - 0x95db3fff com.apple.CoreSymbolication (3.1 - 57020.1) < 7A6A6AD6-E46A-334F-ACC4-41B179505EC9 > /System/Library/PrivateFrameworks/CoreSymbolication.framework/Versions/A/CoreSymbolicatio n

    0x95db4000 - 0x95df3fff com.apple.NavigationServices (3.8 - 215, 1) < 46D8B66D-CB59-36F5-BD26-FD8309337BB3 > /System/Library/Frameworks/Carbon.framework/Versions/A/Frameworks/NavigationServices.fram ework/Versions/A/NavigationServices

    0x95df4000 - 0x95df4fff com.apple.Cocoa /System/Library/Frameworks/Cocoa.framework/Versions/A/Cocoa < 6AF80DDB-C28E-36FF-BC11-D7D561AC52A9 > (6: 8-21)

    0x95df5000 - 0x95e08fff libcmph.dylib (1) < 2449B048-208E-36FB-9DFA-47E0F3BCF132 > /usr/lib/libcmph.dylib

    0x95e09000 - 0x95e0afff libremovefile.dylib (35) < 49DCAF7B-4466-3775-9E58-EA5D7CBA8AE0 > /usr/lib/system/libremovefile.dylib

    0x95e0b000 - 0x95e0dfff libsystem_coreservices.dylib (9) < 20E66A47-8D67-344A-A393-73926F0E5FB2 > /usr/lib/system/libsystem_coreservices.dylib

    0x95e0e000 - 0x95e10fff com.apple.SecCodeWrapper (4.0 - 238.20.2) /System/Library/PrivateFrameworks/SecCodeWrapper.framework/Versions/A/SecCodeWrapper < E70AD7E3-F4A1-3315-ABD9-9FF5078E9EDD >

    0x95e11000 - 0x95efbfff (52.20.2) libcrypto.0.9.8.dylib < 3BE03EE0-9DAE-395D-8292-0371FB21EE3F > /usr/lib/libcrypto.0.9.8.dylib

    0x95efc000 - 0x95f59ff7 com.apple.print.framework.PrintCore /System/Library/Frameworks/ApplicationServices.framework/Versions/A/Frameworks/PrintCore < 86895179-C54B-3D8A-B515-92DFA6315FC9 > (10.3 - 451.1). framework/Versions/A/PrintCore

    0x95f5f000 - 0x95f61ffb libsystem_secinit.dylib (18) < 3CBA3BD3-8BA2-358D-BD1A-A1C3DF5D84E6 > /usr/lib/system/libsystem_secinit.dylib

    0x95fd3000 - 0x96001ff7 libarchive.2.dylib (30) < 8758D35F-ADF8-30F6-8EB2-9B852876EAC8 > /usr/lib/libarchive.2.dylib

    0 x 96002000 - 0x96316fef com.apple.CoreAUC (211.1.0 - 211.1.0) /System/Library/PrivateFrameworks/CoreAUC.framework/Versions/A/CoreAUC < 4ECEBB32-FAA9-357E-BD7D-039E2633AAD5 >

    0 x 96317000 - 0x9631bffb libGIF.dylib (1237) < F831EEB0-3193-32A7-914D-F77C7D5027E3 > /System/Library/Frameworks/ImageIO.framework/Versions/A/Resources/libGIF.dylib

    0x9631c000 - 0x96345fff libRIP.A.dylib (779.11) < 4BD501EF-1671-3165-BD7A-CF227F4BD690 > /System/Library/Frameworks/CoreGraphics.framework/Versions/A/Resources/libRIP.A.dylib

    0 x 96346000 - 0x96447ff7 com.apple.LaunchServices (644.56 - 644.56) < CFF2C4B8-8111-3B9B-A6F7-E2AB33163238 > /System/Library/Frameworks/CoreServices.framework/Versions/A/Frameworks/LaunchServices.fr amework/Versions/A/LaunchServices

    0 x 96448000 - 0x96448fff libOpenScriptingUtil.dylib (162.1) < EDDD4BA8-6212-3437-8CFF-117724C12A4E > /usr/lib/libOpenScriptingUtil.dylib

    0 x 96449000 - 0x96451ffb com.apple.NetFS /System/Library/Frameworks/NetFS.framework/Versions/A/NetFS < 141BFE7E-634E-32A0-8EC9-0A1A4DFEA7D9 > (6.0 - 4.0)

    0 x 96452000 - 0x96885ff3 com.apple.vision.FaceCore (3.1.6 - 3.1.6) < EF92C25B-3E33-379F-A862-75C2FCA8B386 > /System/Library/PrivateFrameworks/FaceCore.framework/Versions/A/FaceCore

    0 x 96886000 - 0x96892ff3 libcommonCrypto.dylib (60061) < 024B3913-15C6-3005-9E5A-EB24918F6977 > /usr/lib/system/libcommonCrypto.dylib

    0 x 96893000 - 0x9689bfff (105.10.1) libsystem_pthread.dylib < 4A229519-29A1-3ABF-8CEF-43BCE4ACDA06 > /usr/lib/system/libsystem_pthread.dylib

    0 x 97220000 - 0x97294fff com.apple.Heimdal /System/Library/PrivateFrameworks/Heimdal.framework/Versions/A/Heimdal < 0082F991-F391-31A6-915C-1FCB0AD004AC > (4.0 - 2.0)

    0 x 97295000 - 0x973d9ff7 com.apple.ImageIO.framework (3.3.0 - 1237) < 314B3F6B-4DC5-31E9-BE67-032901676A34 > /System/Library/Frameworks/ImageIO.framework/Versions/A/ImageIO

    0x973da000 - 0x97445ff7 com.apple.framework.CoreWiFi (3.0 - 300.4) < 632A811D-4706-3ED7-85E3-DD2CDB47CF8F > /System/Library/PrivateFrameworks/CoreWiFi.framework/Versions/A/CoreWiFi

    0 x 97446000 - 0x9745dffb com.apple.AppContainer (4.0 - 238.20.2) /System/Library/PrivateFrameworks/AppContainer.framework/Versions/A/AppContainer < 0A9A3DD3-2D64-3548-8374-96FCE828D151 >

    0x9745e000 - 0x976fffff com.apple.RawCamera.bundle /System/Library/CoreServices/RawCamera.bundle/Contents/MacOS/RawCamera < 9A1642D5-ADFD-37F0-952E-1765C2121593 > (6.06 - 819)

    0 x 97700000 - 0x97719fff com.apple.Kerberos (< 92735F11-CF1C-3FA6-8682-9A30AC9E2651 > /System/Library/Frameworks/Kerberos.framework/Versions/A/Kerberos 3.0 - 1).

    0x977e6000 - 0x97bddfff com.apple.CoreGraphics (1.600.0 - 779.11) /System/Library/Frameworks/CoreGraphics.framework/Versions/A/CoreGraphics < C335E1BE-B524-3EE8-969F-329BE9739CC4 >

    0x97bde000 - 0x97be6fff com.apple.CoreServices.FSEvents (1210.20.1 - 1210.20.1) < FDCAA783-356F-3CA4-B960-16555CD7E34A > /System/Library/Frameworks/CoreServices.framework/Versions/A/Frameworks/FSEvents.framewor k/Versions/A/FSEvents

    0x97be7000 - 0x97bebfff com.apple.CommonPanels (1.2.6 - 96) < 955375E6-2416-38E1-AFC6-477827119329 > /System/Library/Frameworks/Carbon.framework/Versions/A/Frameworks/CommonPanels.framework/ Versions/A/CommonPanels

    0x97c3c000 - 0x97c43fff com.apple.XPCService (< 9A59D63D-446A-33A4-BB21-56E42417DA93 > /System/Library/PrivateFrameworks/XPCService.framework/Versions/A/XPCService 2.0 - 1).

    0x97c44000 - 0x97c50fff com.apple.CrashReporterSupport (10.10 - 631) < 456980E6-2F31-321B-B35D-CA54B88C6F1C > /System/Library/PrivateFrameworks/CrashReporterSupport.framework/Versions/A/CrashReporter Support

    0x97c51000 - 0x97c84fff com.apple.CoreAVCHD (5.7.5 - 5750.4.1) /System/Library/PrivateFrameworks/CoreAVCHD.framework/Versions/A/CoreAVCHD < 103A5EA0-9B75-3B23-BE72-C4DD52744A6A >

    0x97c8e000 - 0x97c90fff (358.20.5) libsystem_sandbox.dylib < FA3A0729-6839-38AC-B365-5E89A125F091 > /usr/lib/system/libsystem_sandbox.dylib

    0x97c91000 - 0x97c93fff (699.1.5) libsystem_configuration.dylib < CC818B5B-D6A6-3313-A0FD-6F781B24DAD4 > /usr/lib/system/libsystem_configuration.dylib

    0x97c94000 - 0x97cbaffb libPng.dylib (1237) < 7EA0DEBE-4000-39D4-89E5-17F655BA317E > /System/Library/Frameworks/ImageIO.framework/Versions/A/Resources/libPng.dylib

    0x97cbb000 - 0x97cbbfff libunc.dylib (29) < CE960997-9D4A-3848-BAC7-B2255E6765FD > /usr/lib/system/libunc.dylib

    0x97cbc000 - 0x97cbfff7 com.apple.help (1.3.3 - 46) < FDF183E4-3B95-3CBD-A390-2536C8E7E258 > /System/Library/Frameworks/Carbon.framework/Versions/A/Frameworks/Help.framework/Versions/A/aide

    0x97cc4000 - 0x97dd1fe3 libvDSP.dylib (516) < 53F7A960-01E1-3B79-A7FD-67BD19471420 > /System/Library/Frameworks/Accelerate.framework/Versions/A/Frameworks/vecLib.framework/Ve rsions/A/libvDSP.dylib

    0x97dd2000 - 0x97e04ffb com.apple.GSS /System/Library/Frameworks/GSS.framework/Versions/A/GSS < 2E9B0C48-962E-3CAB-ABCE-0A16CFCEF53E > (4.0 - 2.0)

    0x97e05000 - 0x97f09ff7 libJP2.dylib (1237) < 3A85AB3C-AFC7-3761-A198-D6C7317E476A > /System/Library/Frameworks/ImageIO.framework/Versions/A/Resources/libJP2.dylib

    0x97f0a000 - 0x98076ff3 com.apple.avfoundation /System/Library/Frameworks/AVFoundation.framework/Versions/A/AVFoundation < C49EA877-535F-3E27-80B2-87AACA207F33 > (2.0 - 889.210)

    0 x 98077000 - 0x98096ff7 com.apple.GenerationalStorage (2.0 - 209.11) < 34CF76B2-8052-359D-816D-092608FB6919 > /System/Library/PrivateFrameworks/GenerationalStorage.framework/Versions/A/GenerationalSt storm

    0 x 98097000 - 0x98124ff3 com.apple.PerformanceAnalysis (lysis of /System/Library/PrivateFrameworks/PerformanceAnalysis.framework/Versions/A/PerformanceAna < AADDDFC1-B4F3-311A-94EF-4D8EAFC2E2C7 > 1.0 - 1.).

    0 x 98125000 - 0x98133ff7 com.apple.SpeechRecognitionCore (2.1.2 - 2.1.2) < CDD0CAA1-DF2E-3FE1-AEE4-4C0823E6FD5C > /System/Library/PrivateFrameworks/SpeechRecognitionCore.framework/Versions/A/SpeechRecogn itionCore

    0 x 98134000 - 0x98139ff7 libcompiler_rt.dylib (35) < 6630682F-AB76-3E55-BE51-0A3E61B6CFC2 > /usr/lib/system/libcompiler_rt.dylib

    0x9813c000 - 0x98252ff3 com.apple.desktopservices (1.9.3 - 1.9.3) < 544FDA55-063A-3787-A55A-A54290E4BE6E > /System/Library/PrivateFrameworks/DesktopServicesPriv.framework/Versions/A/DesktopService sPriv

    0x98d1a000 - 0x98d6bfff com.apple.opencl (2.4.2 - 2.4.2) < 0751975F-97E4-3271-BA93-2FC7A5FDB940 > /System/Library/Frameworks/OpenCL.framework/Versions/A/OpenCL

    0x98d6c000 - 0x98d73fff com.apple.agl (3.3.0 - AGL - 3.3.0) < 8822D220-5EA7-3A56-9EA1-5CE4861EB636 > /System/Library/Frameworks/AGL.framework/Versions/A/AGL

    0x98d74000 - 0x98d74fff libkeymgr.dylib (28) < 06DDCEF8-EB84-3F68-9E19-FD1A12B764FD > /usr/lib/system/libkeymgr.dylib

    0x98d75000 - 0x98e15fff com.apple.QD (301-301) < 4DFE3689-59DE-3FBC-806B-6A4056573E52 > /System/Library/Frameworks/ApplicationServices.framework/Versions/A/Frameworks/QD.framewo rk/Versions/A/QD

    0x98e16000 - 0x98e29fff com.apple.CoreBluetooth (< 153F2DDE-CCCF-3C63-AF70-2EA306DACDCD > /System/Library/Frameworks/CoreBluetooth.framework/Versions/A/CoreBluetooth 1.0 - 1.).

    0x98e2a000 - 0x99212ff7 libLAPACK.dylib (1128) < 4E3D1289-2C98-3E53-BB8D-AD911357FF66 > /System/Library/Frameworks/Accelerate.framework/Versions/A/Frameworks/vecLib.framework/Ve rsions/A/libLAPACK.dylib

    0 x 99213000 - 0x9922aff3 libLinearAlgebra.dylib (1128) < B20FAAAA-1C76-3B20-B100-5FC90F7FE023 > /System/Library/Frameworks/Accelerate.framework/Versions/A/Frameworks/vecLib.framework/Ve rsions/A/libLinearAlgebra.dylib

    0 x 99542000 - 0x9954bfff (118.1.2) libcopyfile.dylib < FAF3268F-C580-33D3-A5B4-74B8A8713216 > /usr/lib/system/libcopyfile.dylib

    0x9954f000 - 0x99550fff libsystem_blocks.dylib (65) < 5D98F022-E863-31D4-8ADE-D53B2AE0D331 > /usr/lib/system/libsystem_blocks.dylib

    0 x 99551000 - 0x995bdff3 com.apple.datadetectorscore (6.0 - 396.1.1) e /System/Library/PrivateFrameworks/DataDetectorsCore.framework/Versions/A/DataDetectorsCor < A1ADB604-689E-3B00-BCB2-1B6662644BBD >

    0x995be000 - 0x99783fff com.apple.QuartzCore /System/Library/Frameworks/QuartzCore.framework/Versions/A/QuartzCore < C2F1A85F-EA5E-3B73-81A2-06E3078202BC > (1.10 - 361.18)

    0 x 99784000 - 0x99788fff libCoreVMClient.dylib (79.1) < 3DB52AB1-D41E-3AC9-A355-1B6DCEDB4DFD > /System/Library/Frameworks/OpenGL.framework/Versions/A/Libraries/libCoreVMClient.dylib

    0 x 99789000 - 0x9978bfff com.apple.securityhi (9.0 - 55006) < B87325C7-1F87-3D3C-874C-9DF59C8EBE1E > /System/Library/Frameworks/Carbon.framework/Versions/A/Frameworks/SecurityHI.framework/Ve rsions/A/SecurityHI

    0x9978c000 - 0x99795ff7 (133.1.1) libsystem_notify.dylib < B8503E99-214B-3AC3-A7CA-CC837ABD7B25 > /usr/lib/system/libsystem_notify.dylib

    0 x 99796000 - 0x99b4aff7 com.apple.CoreFoundation /System/Library/Frameworks/CoreFoundation.framework/Versions/A/CoreFoundation < 267B1002-C755-37B4-95CD-92358CF994B8 > (6, 9 - 1153.18)

    0x99b83000 - 0x99e1cffb com.apple.WebKit (10600 - 10600.5.17) /System/Library/Frameworks/WebKit.framework/Versions/A/WebKit < 080B2D66-0041-3F41-B055-A93179673502 >

    0x99e1d000 - 0x99e9aff3 com.apple.framework.IOKit (2.0.2 - 1050.20.2) /System/Library/Frameworks/IOKit.framework/Versions/A/IOKit < 84299E45-C5F3-365F-AC1B-0EAFF8057112 >

    0x99e9b000 - 0x99e9bfff (559.20.9) liblaunch.dylib < A0885899-CDE9-3688-8C3C-B583E24090E0 > /usr/lib/system/liblaunch.dylib

    0x99e9c000 - 0x9a11aff3 com.apple.security (7.0 - 57031.20.26) /System/Library/Frameworks/Security.framework/Versions/A/Security < 7E5439C5-752D-367F-A28A-AA34C7307981 >

    0x9a11b000 - 0x9a11bfff com.apple.audio.units.AudioUnit /System/Library/Frameworks/AudioUnit.framework/Versions/A/AudioUnit < CFB6243A-1613-3468-88CE-1DDBEC1E6984 > (1.12 - 1.12)

    0x9a11c000 - 0x9a140ffb com.apple.framework.Apple80211 (10.3 - 1030.71.6) /System/Library/PrivateFrameworks/Apple80211.framework/Versions/A/Apple80211 < 84F7040E-713D-3B0E-8397-7CE0C377C52A >

    0x9a141000 - 0x9a1aaff7 (233.1.2) libcorecrypto.dylib < F188C1A7-E88F-3EC5-A6AA-22C02E3F0C93 > /usr/lib/system/libcorecrypto.dylib

    0x9a1ab000 - 0x9a1f2ff3 com.apple.AppleJPEG (< 677BE130-F5AB-36F4-A51A-1FF20FC0085A > /System/Library/PrivateFrameworks/AppleJPEG.framework/Versions/A/AppleJPEG 1.0 - 1.).

    0x9a1f3000 - 0x9a210fff libCRFSuite.dylib (34) < 781A92EF-410E-39B2-953D-FEE12748D834 > /usr/lib/libCRFSuite.dylib

    0x9a211000 - 0x9a266ff3 com.apple.audio.CoreAudio (4.3.0 - 4.3.0) < 2AF304F7-5DA4-3035-9E15-070F16700789 > /System/Library/Frameworks/CoreAudio.framework/Versions/A/CoreAudio

    0x9a267000 - 0x9a282ff3 com.apple.openscripting (1.4 - 162, 1) < CC32543F-0BEA-3022-AF35-5149C50DE902 > /System/Library/Frameworks/Carbon.framework/Versions/A/Frameworks/OpenScripting.framework/Versions/A/OpenScripting

    0x9a283000 - 0x9a3f8ff7 com.apple.QTKit (7.7.3 - 2890) < 2438CD70-8D13-3287-9A43-50B0CD1745DF > /System/Library/Frameworks/QTKit.framework/Versions/A/QTKit

    0x9a3f9000 - 0x9a452ff3 libAVFAudio.dylib (118.6) < D91F498D-AF1E-368B-9DCB-CDA3AAA0E6CD > /System/Library/Frameworks/AVFoundation.framework/Versions/A/Resources/libAVFAudio.dylib

    0x9a4f3000 - 0x9a504fff libbsm.0.dylib (34) < C9F0C608-2794-3F6B-8078-583FC0046039 > /usr/lib/libbsm.0.dylib

    0x9a505000 - 0x9a78afff com.apple.QuickTime (7.7.3 - 2890) < 34289D2B-07CC-3D12-8F32-6F97D96DEE81 > /System/Library/Frameworks/QuickTime.framework/Versions/A/QuickTime

    0x9a78b000 - 0x9a791ff7 com.apple.MediaAccessibility /System/Library/Frameworks/MediaAccessibility.framework/Versions/A/MediaAccessibility < 81E9530E-882C-313C-A4D5-2F43EB569E4F > (1.0 - 61)

    0x9a792000 - 0x9a7b1ffb libresolv.9.dylib (57) < C2C3810A-A45E-3375-B41D-6E1BECE1BA3C > /usr/lib/libresolv.9.dylib

    0x9a7b2000 - 0x9a7b4ffb libRadiance.dylib (1237) < A9D5C5E7-8D9E-308A-BA4F-20491E3F15C4 > /System/Library/Frameworks/ImageIO.framework/Versions/A/Resources/libRadiance.dylib

    0x9a7b5000 - 0x9a808fff com.apple.CoreMediaIO /System/Library/Frameworks/CoreMediaIO.framework/Versions/A/CoreMediaIO < A3BA21A9-5841-3C98-BBE8-A945020745DF > (601, 0-4760)

    0x9a809000 - 0x9a8f5fe7 libvMisc.dylib (516) < C784D56E-112E-359F-848B-3419E0572EB4 > /System/Library/Frameworks/Accelerate.framework/Versions/A/Frameworks/vecLib.framework/Ve rsions/A/libvMisc.dylib

    0x9a8f6000 - 0x9aa28fff com.apple.UIFoundation (< B5B0D178-E1F5-3625-9391-46495E35D540 > /System/Library/PrivateFrameworks/UIFoundation.framework/Versions/A/UIFoundation 1.0 - 1.).

    0x9aa29000 - 0x9aa35ff7 (2782.20.48) libkxld.dylib < A318FD58-B9BA-3548-A8C9-116DB33719A5 > /usr/lib/system/libkxld.dylib

    0x9aa36000 - 0x9aa43ff7 com.apple.speech.synthesis.framework (5.3.3 - 5.3.3) < 3771942E-13BB-30C0-9992-11EE637871DC > /System/Library/Frameworks/ApplicationServices.framework/Versions/A/Frameworks/SpeechSynt hesis.framework/Versions/A/SpeechSynthesis

    0x9aa76000 - 0x9ab0bfff (1044.10.1) libsystem_c.dylib < 9804163C-4DEC-3B94-9854-00248E44554F > /usr/lib/system/libsystem_c.dylib

    0x9ab0c000 - 0x9ab1aff7 libz.1.dylib (55) < DF3B8F77-8931-3A6B-8BDF-DB67315050E6 > /usr/lib/libz.1.dylib

    0x9ab1b000 - 0x9ad11fff libicucore. A.dylib (531.48) < A1002DA8-DAA9-30E8-95AE-1BF575AC5AB5 >/usr/lib/libicucore. A.dylib

    0x9ad12000 - 0x9ad1bfff (11.1.2) libGFXShared.dylib < C67D9D93-6172-3AD6-BBB2-A18C9EC94570 > /System/Library/Frameworks/OpenGL.framework/Versions/A/Libraries/libGFXShared.dylib

    0x9ad1c000 - 0x9ad36ff7 liblzma.5.dylib (7) < D0BC984D-5B33-328C-8F1E-7E9C41813433 > /usr/lib/liblzma.5.dylib

    0x9ad37000 - 0x9ad80ffb libFontRegistry.dylib (134,1) < 6CF6177B-D5D6-3E7B-88BC-BE833D55018C > /System/Library/Frameworks/ApplicationServices.framework/Versions/A/Frameworks/ATS.framew ork/Versions/A/Resources/libFontRegistry.dylib

    0x9ad81000 - 0x9adbdff3 com.apple.RemoteViewServices (2.0 - 99) < 2839C2F1-88DA-3843-87BF-441A374A8967 > /System/Library/PrivateFrameworks/RemoteViewServices.framework/Versions/A/RemoteViewServi CES

    0x9adbe000 - 0x9adcffff (35.20.2) libsystem_coretls.dylib < 3688680D-90B5-373F-9E0D-46809E98B023 > /usr/lib/system/libsystem_coretls.dylib

    0x9add1000 - 0x9add4fff libpam.2.dylib (20) < E2F34522-448A-3392-BC1D-6625BEB612B9 > /usr/lib/libpam.2.dylib

    0x9add5000 - 0x9adf8fff libJPEG.dylib (1237) < 6838FF44-9DF6-349E-AFB4-182F80C2DA79 > /System/Library/Frameworks/ImageIO.framework/Versions/A/Resources/libJPEG.dylib

    0x9adf9000 - 0x9ae1fff7 com.apple.IconServices /System/Library/PrivateFrameworks/IconServices.framework/Versions/A/IconServices < 9C537499-B375-3F84-BF4A-EEF757FC26A9 > (47, 1 - 47.1)

    0x9ae20000 - 0x9ae28ff7 (779.11) libCGCMS.A.dylib < EFC325D4-B616-3739-BAB6-D9C8B74F102F > /System/Library/Frameworks/CoreGraphics.framework/Versions/A/Resources/libCGCMS.A.dylib

    0x9ae29000 - 0x9b1acff7 com.apple.VideoToolbox /System/Library/Frameworks/VideoToolbox.framework/Versions/A/VideoToolbox < 52EE731A-400A-3670-8904-03636C41B4CD > (1.0 - 1562.235)

    0x9b1c0000 - 0x9b1c9ffb com.apple.CommonAuth /System/Library/PrivateFrameworks/CommonAuth.framework/Versions/A/CommonAuth < FFE760A3-FEF7-3009-92E8-893ABB3BC91A > (4.0 - 2.0)

    0x9b1ca000 - 0x9b2bbffb libiconv.2.dylib (42) < 4AF77F10-0BEC-3BE0-99DF-C5170EDB316B > /usr/lib/libiconv.2.dylib

    0x9b2bc000 - 0x9b320ff7 com.apple.AE (681, 2-681, 2) < E56D8304-3975-32E0-BBF2-611F04209C2B > /System/Library/Frameworks/CoreServices.framework/Versions/A/Frameworks/AE.framework/Vers ions/A/AE

    0x9b321000 - 0x9b321fff com.apple.Carbon /System/Library/Frameworks/Carbon.framework/Versions/A/Carbon < CA90E930-DE59-3AD9-B158-3A940BA1FA8A > (154 to 157)

    0x9b32f000 - 0x9b3ccfff (10, 9-213) com.apple.ink.framework < F47949BC-ABEE-329B-B568-71C6FEF761F6 > /System/Library/Frameworks/Carbon.framework/Versions/A/Frameworks/Ink.framework/Versions/ A / ink jet

    0x9b3cd000 - 0x9b3d7ffb com.apple.audio.SoundManager (4.2 - 4.2) < 4312D0A7-4B6F-3A1E-9A47-24C6E8C65E51 > /System/Library/Frameworks/Carbon.framework/Versions/A/Frameworks/CarbonSound.framework/V ersions/A/CarbonSound

    0x9b3d8000 - 0x9b472fff com.apple.ColorSync (4.9.0 - 4.9.0) < E3442A3A-181A-3C39-86D5-89292AF8115F > System/Library/Frameworks/ApplicationServices.framework/Versions/A/Frameworks/ColorSync. framework/Versions/A/ColorSync

    0x9b473000 - 0x9b4adff7 com.apple.DebugSymbols /System/Library/PrivateFrameworks/DebugSymbols.framework/Versions/A/DebugSymbols < D01FFA10-1734-31C5-B5A1-9CB61463FC15 > (115-115)

    0x9b4bb000 - 0x9b50ffff com.apple.HIServices (1.22 - 522, 1) < E46DFA95-A419-32CD-AD1F-C5839F9CF923 > /System/Library/Frameworks/ApplicationServices.framework/Versions/A/Frameworks/HIServices .framework/Versions/A/HIServices

    0x9b513000 - 0x9b553ffb libGLImage.dylib (11.1.2) < 9BAF083D-12EF-3CD9-A875-191B1A3CC687 > /System/Library/Frameworks/OpenGL.framework/Versions/A/Libraries/libGLImage.dylib

    0x9b554000 - 0x9b57aff3 libc ++ abi.dylib (125) < E9AF8CA1-D54D-37E3-8363-A3E8C0840F71 > /usr/lib/libc++abi.dylib

    0x9b57b000 - 0x9b621fff com.apple.Metadata (10.7.0 - 917.35) < 3A9CD210-E9CC-3C1C-A72F-278F0694C1B1 > /System/Library/Frameworks/CoreServices.framework/Versions/A/Frameworks/Metadata.framewor k/Versions/A/metadata

    0x9b622000 - 0x9b62dff7 com.apple.NetAuth /System/Library/PrivateFrameworks/NetAuth.framework/Versions/A/NetAuth < 3E650FB0-5EB5-3807-8B71-8FAF64D6A0FC > (5.2 - 5.2)

    0x9b62e000 - 0x9b7bdff3 libsqlite3.dylib (168) < C3F78985-C19B-3320-9F71-543969632128 > /usr/lib/libsqlite3.dylib

    0x9b7be000 - 0x9b7bffff liblangid.dylib (117) < 34A0F807-755F-300B-B01F-AABAE3838451 > /usr/lib/liblangid.dylib

    0x9b7c0000 - 0x9b7ceff3 com.apple.opengl (11.1.2 - 11.1.2) < F252DF22-C5E2-3A47-ACB6-2B02D6164A47 > /System/Library/Frameworks/OpenGL.framework/Versions/A/OpenGL

    0x9b7cf000 - 0x9b8c6ff7 libFontParser.dylib (134,2) < 1CE9DA9E-FBF3-32E4-838D-455EA531F26E > /System/Library/Frameworks/ApplicationServices.framework/Versions/A/Frameworks/ATS.framew ork/Versions/A/Resources/libFontParser.dylib

    0x9b8c7000 - 0x9b8e0fff libsystem_malloc.dylib (53.1.1) < 58CD8BC7-55D1-3862-8E5D-728EE2EBE447 > /usr/lib/system/libsystem_malloc.dylib

    0x9b8e1000 - 0x9b941fff com.apple.AppleVAFramework (5.0.31 - 5.0.31) /System/Library/PrivateFrameworks/AppleVA.framework/Versions/A/AppleVA < 2FFC7C07-CA18-3959-B8F6-F620025BCD86 >

    0x9b942000 - 0x9b944fff (11.1.2) libCVMSPluginSupport.dylib < 2C725DC9-0773-3637-B905-7A8B2001192F > /System/Library/Frameworks/OpenGL.framework/Versions/A/Libraries/libCVMSPluginSupport.dyl ib

    0x9b945000 - 0x9b950ff7 com.apple.AppSandbox (4.0 - 238.20.2) /System/Library/PrivateFrameworks/AppSandbox.framework/Versions/A/AppSandbox < E81603D8-FA25-3667-999C-E5A9DF790CB4 >

    0x9b951000 - 0x9b97dfff com.apple.ChunkingLibrary (2.1 - 163, 6) < D5446A27-C51B-36D7-A4A1-3222A87F6F48 > /System/Library/PrivateFrameworks/ChunkingLibrary.framework/Versions/A/ChunkingLibrary

    0x9ba0d000 - 0x9bd67ff7 libmecabra.dylib (666,7) < 55A50B97-92D3-3DDC-8E3A-58BC5FFE5E3F > /usr/lib/libmecabra.dylib

    0x9bd68000 - 0x9be7bfff com.apple.MediaControlSender (2.0 - 215.18) < D35B4B09-AE31-3028-ACEE-E86991772577 > /System/Library/PrivateFrameworks/MediaControlSender.framework/Versions/A/MediaControlSen der

    0x9be86000 - 0x9be89fff com.apple.xpc.ServiceManagement (< D23A7F03-979D-3A78-B1F6-645D2EFEEF66 > /System/Library/Frameworks/ServiceManagement.framework/Versions/A/ServiceManagement 1.0 - 1.).

    0x9be8a000 - 0x9bea9fff (2782.20.48) libsystem_kernel.dylib < D1D17CE0-1D1D-3243-9E9D-78C70F19B0ED > /usr/lib/system/libsystem_kernel.dylib

    0x9beaa000 - 0x9bf21ff7 com.apple.CoreUtils /System/Library/PrivateFrameworks/CoreUtils.framework/Versions/A/CoreUtils < 1667BF42-48D3-3B3D-A9CF-0868178DD2EB > (1.1 - 110.1)

    0x9bf22000 - 0x9bf41ff7 com.apple.MultitouchSupport.framework (263.9.1 - 263.9.1) t /System/Library/PrivateFrameworks/MultitouchSupport.framework/Versions/A/MultitouchSuppor < 9265A1BE-FA6F-38C7-BDFB-FA05EEC683CE >

    0x9bf42000 - 0x9bf44fff com.apple.loginsupport (1.0-1) < BA8EEAD0-8E97-3219-949B-50AE67F8869E > /System/Library/PrivateFrameworks/login.framework/Versions/A/Frameworks/loginsupport.fram ework/Versions/A/loginsupport

    0x9bf45000 - 0x9bf6ffff libxslt.1.dylib (13) < 0F55B64A-6C55-304E-ACE0-B531027AA066 > /usr/lib/libxslt.1.dylib

    0x9bf70000 - 0x9c3abfeb com.apple.vImage (8.0 - 8, 0) < 56F6B317-9D70-3DC5-9868-BB6D7CB6E55D > /System/Library/Frameworks/Accelerate.framework/Versions/A/Frameworks/vImage.framework/Ve rsions/A/vImage

    0x9c3ac000 - 0x9c3b5fff com.apple.AppleSRP (< 41C48FA8-C249-3800-A551-7F4AFA3E723F > /System/Library/PrivateFrameworks/AppleSRP.framework/Versions/A/AppleSRP 5.0 - 1).

    0x9c3b6000 - 0x9c3bbff7 libmacho.dylib (862) < 48DE74F8-09E3-344F-A82F-665083A3BF8F > /usr/lib/system/libmacho.dylib

    0x9c3bc000 - 0x9c3e5fff (459.20.1) libsystem_info.dylib < 91DEA2CC-26A7-32CD-ABC5-0B2754874E38 > /usr/lib/system/libsystem_info.dylib

    0x9c414000 - 0x9c42fff7 com.apple.CFOpenDirectory /System/Library/Frameworks/OpenDirectory.framework/Versions/A/Frameworks/CFOpenDirectory < 44C81E98-710E-30EB-829D-7374B9339345 > (10.10 - 187). framework/Versions/A/CFOpenDirectory

    0x9c430000 - 0x9c470fff com.apple.Symbolication /System/Library/PrivateFrameworks/Symbolication.framework/Versions/A/Symbolication < BE1C4846-DA11-365D-9B46-3FF130401839 > (1.4 - 56045)

    0xba900000 - 0xba91dfff libJapaneseConverter.dylib (64) < 7265FE24-923E-3CF7-92D6-DB6EFB9E8379 > /System/Library/CoreServices/Encodings/libJapaneseConverter.dylib

    Summary of the external change:

    Calls made by other processes for this process:

    task_for_pid: 1

    thread_create: 0

    thread_set_state: 0

    Calls made by this process:

    task_for_pid: 0

    thread_create: 0

    thread_set_state: 0

    Calls made by all processes on this machine:

    task_for_pid: 44850

    thread_create: 0

    thread_set_state: 0

    Summary region VM:

    ReadOnly part of libraries: Total = 259.9 M resident=150.7M(58%) swapped_out_or_unallocated=109.2M(42%)

    Regions in writing: Total = 209.4 M written = 3820 K (2%) resident = 9944 K (5%) swapped_out = 0 K (0%) unallocated=199.7M(95%)

    VIRTUAL FIELD TYPE

    ===========                      =======

    CG backup stores 12K

    CG shared images 176K

    Image IO 8K

    Time 4K kernel Alloc

    MALLOC 80.1 M

    MALLOC (admin) 48K

    Tag memory 255 19.2 M

    Tag 12K (reserved) 255 reserved VM (Unassigned) memory address space

    Battery 181,0 M

    VM_ALLOCATE 1212K

    __DATA                             10.5M

    __IMAGE 528K

    __LINKEDIT 45.9 M

    __OBJC K 2940

    __TEXT 214,1 M

    __UNICODE 552K

    mapped file 137.1 M

    shared memory 12K

    ===========                      =======

    TOTAL 693,3 M

    In TOTAL, less space reserved VM 693,3 M

    I found a solution here:

    Accident of creative cloud of Yosemite

    I had to go to my library > InputManagers folder and delete the "CoolIris" input manager, which is an extension chrome I had uninstalled long ago.

Maybe you are looking for

  • Firefox supports Windows XP SP3?

    Now that we are in April 2015, Will Firefox provide some updates and fixes for Windows XP SP3 users? Google made Chrome support XP until April 2015, I cannot afford to buy a new computer and am looking for a new browser for my Windows XP SP3 laptop.

  • How to remove a Trojan virus

    I opened Safari and immediately he began by a screen of loading with a pop-up window and a voice saying: "please contact this number" I forced Safari leave immediately and have an anti virus scan and it came with 7 virus - namely VBA:Downloader - AOV

  • Portege M400 screen deforms to the centre when writing

    Hello When written on or near the center of the screen image to the center of the screen distorts a little, as when you touch a normal LCD and the screen colors change. It does not take a lot of pressure to do. Is this behavior typical for a tablet p

  • call by reference and physical channel OR DAQMX

    Hello I call a VI of reference and one of its entries is a physical channel OR DAQMX. Normally when I call the VI (no ref) control of the physical channel OR DAQMX fill itself with a list of detected devices / channels. Still by reference it does not

  • BATTERY FOR T400

    Hi, is there a battery for thinkpad T400 12cell? because my battery 9 cells can contain only 56% of its original capacity. Thank you.