Error ORA-20001 while trying to reset the password of Admin 4.2 Apex

Hello

I had to reset my password admin apex and tried to launch as below mentioned the apxchpwd.sql script, but I got an ORA-20001.

I checked in my console (OEM) the status of the user apex_040200 and status is expired, but not locked...

Any idea of the reason for the error?

This is the result I got while running the script:

Connected to:

Oracle Database 11 g Enterprise Edition Release 11.2.0.1.0 - 64 bit Production

With partitioning, OLAP, Data Mining and Real Application Testing options

SQL > connect [email protected] as sysdba

Enter password: *.

Connected.

SQL > @apxchpwd

Syntax: SET SERVEROUTPUT {ON |} {OFF} [SIZE n]

[[MAST] {WRA [DETERIORATED] |}] WOR [D_WRAPPED] | TRU [NCATED]}]

Enter a lower value for the password for the user of the Application ADMIN Express.

Enter a password for the user ADMIN [] *.

Modified session.

.. .the ADMIN password

declare

*

ERROR on line 1:

ORA-20001: password validation failure

ORA-06512: at line 33 level

Advertisement

Hello

In fact, it seems to be a known issue with Apex 4.2.2 and there is a note in Metalink (support.oracle.com) on this subject:Doc ID 1579712.1

Although it is not documented while the script asks you a new password, you must keep in mind the following:

Password is not consistent with the rules of this site password complexity.
* Password must contain at least one alphabetic character ().
* Password must contain at least one punctuation character ().
* Password must contain at least one uppercase alphabetic character.
* Password must contain at least one alphabetic character tiny.

Tags: Database

Similar Questions

  • I get an error code 646 while trying to download the updates

    I get an error code 646 while trying to download the updates, update security for Microsoft Works 9 (KB2431831)

    Download size: 2.1 MB

    Help, please

    See this thread:

    http://social.answers.Microsoft.com/forums/en-us/vistawu/thread/0c397230-26c6-4214-a5d1-3c99d2b2ef47

  • I'm running into this error message to a sysprep to capture a WIM image modified: "a fatal error has occurred while trying to sysprep the machine."

    Original title: WDS & Sysprep

    Hello

    I'm running into this error message to a sysprep to capture a WIM updated image the:
    3.14 system preparation tool
    "A fatal error has occurred while trying to sysprep the machine."
    She is probably explained by the time of Amendment 3, but is there a way to bypass that force me to change the registry whenever I use the new image?
    Any recommendations on how to solve this problem would be appreciated.
    Thank you.

    GN

    Please post your request here:

  • How change/reset the passwords of admin of the auditor and Manager

    I have request Express the listener in a stand-alone installation on Oracle 11 g R2, how do I reset the passwords of Admin and feeder access the listenerAdmin.
    Listener already configured.

    Currently when I try to access apex/listenerAdmin I get requests for leave (by default / user/passwords username provided does not work).

    Thank you

    Hello

    "The xxxxx in XDB server requires username and password." (if I fill password user XDB) query appears:
    "The server at the APEX xxxxx requires username and password"

    It sounds like you still have active and configured listener APEX XDB HTTP Server to use the same TCP port. Unfortunately, the listener and Server HTTP XDB APEX use port 8080 by default. Configure a service to use a different port or disable XDB HTTP server completely, if you don't need otherwise, to resolve the conflict of port.
    To leave the APEX listener to use a different port, simply start with the apex.port parameter, for example

    java -jar -Dapex.port=8081 apex.war
    

    To change the port of XDBs, you need your user name sys (for example connection with sqlplus under sys as sysdba) and run the corresponding API command, for example

    sqlplus / as sysdba
    exec dbms_xdb.sethttpport(0);
    commit;
    

    where 0 is the value to disable the service completely. Use another port if you rather want to use it and don't want to not use APEX listens on a different port than 8080.

    -Udo

    Published by: Udo on 15.02.2012 15:38

  • a disk error has occurred while trying to write the following file

    I was working on my video and I put in a video file and a 10 seconds later, I get an error saying "a disk error occurred while trying to write the following file.

    and audio of the video was not working I close Premiere Pro and open again to do the same thing and it happens again if you know how to fix this please tell me I need to change my video so I can get it to the top on youtube tomorrow.Help pls.png

    I contacted support and it turns off everything, I had to do was move the first clip on the desktop... lol Thanks much for the great help! Sorry for the trouble

  • HP Deskjet 3545: How to reset the password of admin for HP Deskjet 3545. Cannot connect to the administrator settings page.

    I put a password for the printer. And whenever I try to open a session with him, he keeps asking the user name and password. So I want to reset the password or leave the field empty. Please help urgently.

    Hi @flame_ardor,

    Welcome to the Forums of HP Support! I understand you want to reset the password for your HP Deskjet Ink Advantage 3545.

    You should be able to do this by restoring the default network settings in the front panel of the DJ 3545:

    On the printer control panel, press the Wireless button. Wireless menu.

  • How can I reset the password of admin for HP Deskjet Ink Advantage 2545

    I lost the password to unlock the settings of the printer. Is it possible for me to put this?

    Welcome @jaraneta,

    Thanks to their participation in Forums of HP! I see by your post that you need to reset the password of the printer. I will definitely do my best to help you.

    I can send you this information in a private message.
    In the forum next to your name to handle just click on the envelope
    to see it.

    Feel free to click on the button "Accept as Solution" and the
    'Thumbs Up' for my help. Please let me know the results
    and if there is anything else I can help you. Thank you!

  • Get the error ORA-39146 while trying to import data from 10 g to 12 c

    Hi all


    im getting below error while trying to import data from 10 g to 12 c


    ORA-39146: schema 'B_SITES' does not exist
    import in WE8MSWIN1252 and AL16UTF16 NCHAR character set
    export in the UTF8 character set and AL16UTF16 NCHAR character set
    ATTENTION: the possible loss of data to character set conversions


    can someone help how do we change to WE8MSWIN1252 UTF8 character set...

    Hello

    "ORA-39146: there is no schema 'B_SITES'.

    ORA-39146: schema 'string' does not exist

    Cause: The specified schema was referenced as the source of a REMAP_SCHEMA parameter, but did not exist in the dump file (for

    Action: Specify the correct name of the schema to be remapped.

    Anand

  • Error (ORA-12547) while trying to create a database on AWS ec2

    Hello world

    I am trying to install Oracle 12 c DB on an Amazon ec2 'Machine' (RHEL 7.1).

    Start the Machine, unzip the files (12.1.0.2.0 for x 86-64 Linux download from OTN) and installation of the database to help. / runInstaller succeeded. But when I am trying to create a database now, it fails with the "ORA-12547: TNS: lost contact" error.

    That's what I entered:

    [data [email protected]] $ dbca-silent - createDatabase.

    -templateName General_Purpose.dbc.

    gdbname-cdb1 sid cdb1 - responsefile NO_VALUE.

    -characterSet AL32UTF8------.

    -sysPassword OraPasswd1.

    -systemPassword OraPasswd1.

    true - createAsContainerDatabase.

    -numberOfPDBs 1.

    pdbName - pdb1------.

    -pdbAdminPassword OraPasswd1.

    databaseType - MULTIPURPOSE.

    false - automaticMemoryManagement.

    -storageType FS.

    -ignorePreReqs

    That's what the console showed:

    Cleaning of the steps failed

    DBCA_PROGRESS: 4%

    Copying database files

    DBCA_PROGRESS: 5%

    ORA-12547: TNS: lost contact

    DBCA_PROGRESS: 7%

    The cataloguing of backups RMAN error

    DBCA_PROGRESS: DBCA operation failed.

    Examine the log file ' / u01/app/oracle/cfgtoollogs/dbca/cdb1/cdb117.log ' for details.

    Here are the contents of cdb117.log:

    The database Configuration Wizard failed to detect options for the Installation of Oracle.

    ORA-12547: TNS: lost contact

    Because of this failure certain features of the database Configuration Wizard will be unavailable. Do you want to continue?

    Checking database unique identifier passed.

    / has enough space. Space required is 7665 MB, available space is 17768 MB.

    File of successful Validations.

    Cleaning of the steps failed

    DBCA_PROGRESS: 4%

    Copying database files

    DBCA_PROGRESS: 5%

    ORA-12547: TNS: lost contact

    DBCA_PROGRESS: 7%

    The cataloguing of backups RMAN error

    DBCA_PROGRESS: DBCA operation failed.

    And here is the content of the file trace.log:

    [main] [2015-11-11 04:04:19.802 EST] [Host. < init >: 1090]  Start tracing...

    [main] [2015-11-11 04:04:19.874 EST] [SilentHost.initialize:187]  SilentHost-> initialization: m_tempLogFile = /u01/app/oracle/cfgtoollogs/dbca/silent.log_2015-11-11_04-04-19-AM

    [main] [2015-11-11 04:04:19.877 EST] [Host.checkIfBigClusterAndHubNode:1710]  Not a cluster environment: out BigCluster Check

    [main] [2015-11-11 04:04:19.877 EST] [InventoryUtil.getOracleBase:149]  ORACLE_BASE to get inventory.

    [main] [2015-11-11 04:04:19.879 EST] Setting [InventoryUtil.getOUIInvSession:349] YES READ at ACCESSLEVEL_READ_LOCKLESS

    [main] [2015-11-11 04:04:19.879 EST] [InventoryUtil.getOracleBase:164]  The size of the inventory home = 1

    [main] [2015-11-11 04:04:19.901 EST] [InventoryUtil.getOracleBase:189]  ORACLE_BASE returned from inventory: = / u01/app/oracle

    [main] [2015-11-11 04:04:19.901 EST] [Host.displayOracleBaseWarning:1750] oracleBaseFromEnv null

    [main] [2015-11-11 04:04:19.902 EST] [Host.displayOracleBaseWarning:1756] oracle_base to oracle_base/u01/app/oracle YES env/u01/app/oracle

    [main] [2015-11-11 04:04:19.903 EST] Setting [InventoryUtil.getOUIInvSession:349] YES READ at ACCESSLEVEL_READ_LOCKLESS

    [main] [2015-11-11 04:04:19.903 EST] [InventoryUtil.isCRSHome:386]  HomeInfo /u01/app/oracle/product/12.1.0.2/db_1,1

    [main] [2015-11-11 04:04:20.135 EST] [Host.validateGridHome:3878]  Fake of validation

    [main] [2015-11-11 04:04:20.135 EST] [Host.startOperation:2395]  Source db null

    [main] [2015-11-11 04:04:20.135 EST] [Host.startOperation:2396]  Cdb1 name of GDB

    [main] [2015-11-11 04:04:20.152 EST] [Host.startOperation:2397]  Sid - MGMTDB MgmtDB

    [main] [2015-11-11 04:04:20.152 EST] [Host.startOperation:2398]  MgmtDB name _mgmtdb

    [main] [2015-11-11 04:04:20.152 EST] [HADatabaseUtils.isGridMgmtDB:2842]  Mgmt DBName srvm _mgmtdb

    [main] [2015-11-11 04:04:20.155 EST] [OracleHome.getVersion:991]  Called OracleHome.getVersion.  Current version: null

    [main] [2015-11-11 04:04:20.157 EST] Setting [InventoryUtil.getOUIInvSession:349] YES READ at ACCESSLEVEL_READ_LOCKLESS

    [main] [2015-11-11 04:04:20.157 EST] [OracleHome.getVersion:1010]  HomeInfo /u01/app/oracle/product/12.1.0.2/db_1,1

    [main] [2015-11-11 04:04:20.252 EST] [OracleHome.getVersion:1038]  OracleHome.server.getVersion Version: 12.1.0.2.0

    [main] [2015-11-11 04:04:20.252 EST] [OracleHome.getVersion:1059]  The current Version of the inventory: 12.1.0.2.0

    [main] [2015-11-11 04:04:20.252 EST] [OracleHome.getVersion:991]  Called OracleHome.getVersion.  Current version: 12.1.0.2.0

    [main] [2015-11-11 04:04:20.252 EST] [OracleHome.getVersion:1059]  The current Version of the inventory: 12.1.0.2.0

    [main] [2015-11-11 04:04:20.252 EST] [CommonUtils.createPasswordFile:1243] orapwd new appeal for 11.1 or above

    [main] [2015-11-11 04:04:20.253 EST] [OracleHome.getVersion:991]  Called OracleHome.getVersion.  Current version: 12.1.0.2.0

    [main] [2015-11-11 04:04:20.253 EST] [OracleHome.getVersion:1059]  The current Version of the inventory: 12.1.0.2.0

    [main] [2015-11-11 04:04:20.253 EST] [OracleHome.getVersion:991]  Called OracleHome.getVersion.  Current version: 12.1.0.2.0

    [main] [2015-11-11 04:04:20.253 EST] [OracleHome.getVersion:1059]  The current Version of the inventory: 12.1.0.2.0

    [main] [2015-11-11 04:04:20.253 EST] [CommonUtils.getPasswordFileCreateCmd:1182] for new orapwd to 11.1 or above

    [main] [2015-11-11 04:04:20.255 EST] [OracleHome.getVersion:991]  Called OracleHome.getVersion.  Current version: 12.1.0.2.0

    [main] [2015-11-11 04:04:20.256 EST] [OracleHome.getVersion:1059]  The current Version of the inventory: 12.1.0.2.0

    [main] [2015-11-11 04:04:20.256 EST] [OracleHome.getVersion:991]  Called OracleHome.getVersion.  Current version: 12.1.0.2.0

    [main] [2015-11-11 04:04:20.256 EST] [OracleHome.getVersion:1059]  The current Version of the inventory: 12.1.0.2.0

    [main] [2015-11-11 04:04:20.256 EST] /U01/app/oracle/product/12.1.0.2/db_1/bin/orapwd [CommonUtils.getPasswordFileCreateCmd:1213]

    [main] [2015-11-11 04:04:20.256 EST] File=/U01/app/Oracle/product/12.1.0.2/Db_1/DBS/orapwDBUA0420152 [CommonUtils.getPasswordFileCreateCmd:1213]

    [main] [2015-11-11 04:04:20.256 EST] Force [CommonUtils.getPasswordFileCreateCmd:1213] = y

    [main] [2015-11-11 04:04:20.256 EST] [CommonUtils.getPasswordFileCreateCmd:1213] format = 12

    [main] [2015-11-11 04:04:20.257 EST] [OsUtilsBase.execProg:2123] start execProg with the input array.

    [main] [2015-11-11 04:04:20.272 EST] [OsUtilsBase.execProg:2160] done execProg with the input array. Status: 0

    [main] [2015-11-11 04:04:20.272 EST] [OracleHome.initOptionsStopOnError:1356]  Initialization of the database Options with dummy sid = DBUA0420152 using initfile=/u01/app/oracle/product/12.1.0.2/db_1/dbs/initDBUA0420152.ora using pwdfile=/u01/app/oracle/product/12.1.0.2/db_1/dbs/orapwDBUA0420152

    [main] [2015-11-11 04:04:20.274 EST] [OracleHome.getVersion:991]  Called OracleHome.getVersion.  Current version: 12.1.0.2.0

    [main] [2015-11-11 04:04:20.274 EST] [OracleHome.getVersion:1059]  The current Version of the inventory: 12.1.0.2.0

    [main] [2015-11-11 04:04:20.274 EST] [OracleHome.getVersion:991]  Called OracleHome.getVersion.  Current version: 12.1.0.2.0

    [main] [2015-11-11 04:04:20.275 EST] [OracleHome.getVersion:1059]  The current Version of the inventory: 12.1.0.2.0

    [main] [2015-11-11 04:04:20.275 EST] [OracleHome.getVersion:991]  Called OracleHome.getVersion.  Current version: 12.1.0.2.0

    [main] [2015-11-11 04:04:20.275 EST] [OracleHome.getVersion:1059]  The current Version of the inventory: 12.1.0.2.0

    [main] [2015-11-11 04:04:20.275 EST] [SQLPlusEngine.getCmmdParams:225] m_home 12.1.0.2.0

    [main] [2015-11-11 04:04:20.275 EST] True for 112 > version [SQLPlusEngine.getCmmdParams:226]

    [main] [2015-11-11 04:04:20.276 EST] [SQLEngine.getEnvParams:602]  By default the NLS_LANG: AMERICAN_AMERICA. AL32UTF8

    [main] [2015-11-11 04:04:20.276 EST] [SQLEngine.getEnvParams:612]  NLS_LANG: AMERICAN_AMERICA. AL32UTF8

    [main] [2015-11-11 04:04:20.277 EST] [SQLEngine.initialize:358]  SQLPLUS/OPEN process execing...

    [main] [2015-11-11 04:04:20.288 EST] M_bReaderStarted [SQLEngine.initialize:395]: false

    [main] [2015-11-11 04:04:20.288 EST] [SQLEngine.initialize:399]  From the wire drive...

    [main] [2015-11-11 04:04:20.302 EST] [SQLEngine.done:2278]  Called

    [main] [2015-11-11 04:04:20.302 EST] [OracleHome.initOptionsStopOnError:1409]  ORA-12547: TNS: lost contact

    [main] [2015-11-11 04:04:20.303 EST] [OracleHome.initOptionsStopOnError:1410]  ORA-12547: TNS: lost contact

    oracle.sysman.assistants.util.sqlEngine.SQLEngine.executeImpl(SQLEngine.java:1739)

    oracle.sysman.assistants.util.sqlEngine.SQLEngine.connect(SQLEngine.java:987)

    oracle.sysman.assistants.util.OracleHome.initOptionsStopOnError(OracleHome.java:1362)

    oracle.sysman.assistants.dbca.backend.Host.startOperation(Host.java:2411)

    oracle.sysman.assistants.dbca.Dbca.execute(Dbca.java:153)

    oracle.sysman.assistants.dbca.Dbca.main (Dbca.java:226)

    [main] [2015-11-11 04:04:20.303 EST] [OracleHome.initOptionsStopOnError:1419] closing dummy instance

    [main] [2015-11-11 04:04:20.303 EST] [SQLEngine.reInitialize:785]  The SQLEngine reset...

    [main] [2015-11-11 04:04:20.303 EST] [OracleHome.getVersion:991]  Called OracleHome.getVersion.  Current version: 12.1.0.2.0

    [main] [2015-11-11 04:04:20.303 EST] [OracleHome.getVersion:1059]  The current Version of the inventory: 12.1.0.2.0

    [main] [2015-11-11 04:04:20.303 EST] [OracleHome.getVersion:991]  Called OracleHome.getVersion.  Current version: 12.1.0.2.0

    [main] [2015-11-11 04:04:20.304 EST] [OracleHome.getVersion:1059]  The current Version of the inventory: 12.1.0.2.0

    [main] [2015-11-11 04:04:20.304 EST] [OracleHome.getVersion:991]  Called OracleHome.getVersion.  Current version: 12.1.0.2.0

    [main] [2015-11-11 04:04:20.304 EST] [OracleHome.getVersion:1059]  The current Version of the inventory: 12.1.0.2.0

    [main] [2015-11-11 04:04:20.304 EST] [SQLPlusEngine.getCmmdParams:225] m_home 12.1.0.2.0

    [main] [2015-11-11 04:04:20.304 EST] True for 112 > version [SQLPlusEngine.getCmmdParams:226]

    [main] [2015-11-11 04:04:20.305 EST] [SQLEngine.getEnvParams:602]  By default the NLS_LANG: AMERICAN_AMERICA. AL32UTF8

    [main] [2015-11-11 04:04:20.305 EST] [SQLEngine.getEnvParams:612]  NLS_LANG: AMERICAN_AMERICA. AL32UTF8

    [main] [2015-11-11 04:04:20.305 EST] [SQLEngine.initialize:358]  SQLPLUS/OPEN process execing...

    [main] [2015-11-11 04:04:20.316 EST] M_bReaderStarted [SQLEngine.initialize:395]: false

    [main] [2015-11-11 04:04:20.316 EST] [SQLEngine.initialize:399]  From the wire drive...

    [main] [2015-11-11 04:04:20.317 EST] [SQLEngine.initialize:448]  Waiting for m_bReaderStarted to be true

    [main] [2015-11-11 04:04:20.336 EST] [SQLEngine.done:2278]  Called

    [main] [2015-11-11 04:04:20.336 EST] [OracleHome.initOptionsStopOnError:1426] fake closing instance failed

    [main] [2015-11-11 04:04:20.336 EST] [OracleHome.initOptionsStopOnError:1458]  Data bases query options: 0

    [main] [2015-11-11 04:04:20.337 EST] [Host.checkOPS:2082]  Domestic CheckOPS

    [main] [2015-11-11 04:04:20.337 EST] [Host.checkOPS:2094]  Try to check the existence of cluster

    [main] [2015-11-11 04:04:20.337 EST] [Host.checkOPS:2099] cluster existence: false

    [main] [2015-11-11 04:04:20.337 EST] [Host.checkOPS:2108]  Fake installed cluster

    [main] [2015-11-11 04:04:20.337 EST] [Host.checkOPS:2124]  Cluster installed = false

    [main] [2015-11-11 04:04:20.455 EST] [TemplateManager.validateTemplate:636]  Validation of the model's success

    [main] [2015-11-11 04:04:20.458 EST] [HADatabaseUtils.isGridMgmtDB:2842]  Mgmt DBName srvm _mgmtdb

    [main] [2015-11-11 04:04:20.458 EST] [HAUtils.getCurrentOracleHome:593]  Home of the Oracle system property: /u01/app/oracle/product/12.1.0.2/db_1

    [main] [2015-11-11 04:04:20.458 EST] [HAUtils.getConfiguredGridHome:1343] - HOUSE of CRS.

    [main] [2015-11-11 04:04:20.458 EST] [UnixSystem.getCRSHome:2878] olrFileName = /etc/oracle/olr.loc

    [main] [2015-11-11 04:04:20.458 EST] [HAUtils.getHASHome:1500]  Could not get at home.

    PRCI-1144: Impossible to retrieve the path home Oracle Grid Infrastructure

    PRKC-1144: File ' / etc/oracle/olr.loc ' not found.

    [main] [2015-11-11 04:04:20.459 EST] [StepContext.setListenersToUpdate:946] needLocalListener = false

    [main] [2015-11-11 04:04:20.462 EST] [OracleHome.hasEELicense:247]  Running script to determine licensing: /u01/app/oracle/product/12.1.0.2/db_1/bin/bndlchk

    [main] [2015-11-11 04:04:20.489 EST] Home=/U01/app/Oracle/product/12.1.0.2/Db_1 [OracleHome.hasEELicense:258] has EE licenses

    [main] [2015-11-11 04:04:20.490 EST] [OracleHome.isDatabaseOptionOn:1251]  Audit database option: space

    [main] [2015-11-11 04:04:20.490 EST] [OracleHome.isDatabaseOptionOn:1308]  Spatial database option is false

    [main] [2015-11-11 04:04:20.496 EST] [OracleHome.isDatabaseOptionOn:1251]  Option to check database: OLAP

    [main] [2015-11-11 04:04:20.496 EST] [OracleHome.isDatabaseOptionOn:1308]  Database OLAP Option is false

    [main] [2015-11-11 04:04:20.497 EST] [OracleHome.hasEELicense:247]  Running script to determine licensing: /u01/app/oracle/product/12.1.0.2/db_1/bin/bndlchk

    [main] [2015-11-11 04:04:20.507 EST] Home=/U01/app/Oracle/product/12.1.0.2/Db_1 [OracleHome.hasEELicense:258] has EE licenses

    [main] [2015-11-11 04:04:20.509 EST] [InitParamHandler.endElement:547]  CustomSGA flag: false

    [main] [2015-11-11 04:04:20.509 EST] [InitParamHandler.endElement:548]  Database Type: MULTIFUNCTION

    [main] [2015-11-11 04:04:20.509 EST] [InitParamHandler.endElement:549]  Percentage of MEM: 40

    [main] [2015-11-11 04:04:20.520 EST] [OsUtilsBase.getTotalPhysicalMemory:411]  Total physical memory in MB: 992

    [main] [2015-11-11 04:04:20.520 EST] [InitParamHandler.endElement:582]  MB of total memory: 396

    [main] [2015-11-11 04:04:20.520 EST] [InitParamHandler.endElement:583]  MB physical memory: 992

    [main] [2015-11-11 04:04:20.521 EST] [OsUtilsBase.is64Bit:395] architecture is 64-bit: true

    [main] [2015-11-11 04:04:20.521 EST] [MemoryCalculator. < clinit >: 103] minimum setting memory for 64-bit

    [main] [2015-11-11 04:04:20.525 EST] [MemoryCalculator.isUnifiedMemoryFeasible:381]  Volume: /.

    [main] [2015-11-11 04:04:20.525 EST] [MemoryCalculator.isUnifiedMemoryFeasible:381]  Volume: / proc

    [main] [2015-11-11 04:04:20.525 EST] [MemoryCalculator.isUnifiedMemoryFeasible:381]  Volume: / sys

    [main] [2015-11-11 04:04:20.525 EST] [MemoryCalculator.isUnifiedMemoryFeasible:381]  Volume: / dev

    [main] [2015-11-11 04:04:20.525 EST] [MemoryCalculator.isUnifiedMemoryFeasible:381]  Volume: / sys/kernel/security

    [main] [2015-11-11 04:04:20.525 EST] [MemoryCalculator.isUnifiedMemoryFeasible:381]  Volume: / dev/shm

    [main] [2015-11-11 04:04:20.526 EST] [MemoryCalculator.isUnifiedMemoryFeasible:388] / dev/shm feasible: true

    [main] [2015-11-11 04:04:20.526 EST] [InitParamHandler.endElement:600] / dev/shm size in MB: 496

    [main] [2015-11-11 04:04:20.526 EST] True bUseUnified [InitParamHandler.endElement:608]

    [main] [2015-11-11 04:04:20.527 EST] [DatafileCloneHandler.startElement:209] atts name CBD

    [main] [2015-11-11 04:04:20.527 EST] Value true length atts [DatafileCloneHandler.startElement:211]

    [main] [2015-11-11 04:04:20.532 EST] [DatabaseStorageAttributes.addRedoLogGroup:331]  This thread doesnot exist in a thread in the group mapping

    [main] [2015-11-11 04:04:20.532 EST] [DatabaseStorageAttributes.addRedoLogGroup:269]  ThreadID = 1 course

    [main] [2015-11-11 04:04:20.532 EST] [DatabaseStorageAttributes.addRedoLogGroup:270] newThread threadID = 1

    [main] [2015-11-11 04:04:20.532 EST] RedoGroups.length [DatabaseStorageAttributes.addRedoLogGroup:303] 1

    [main] [2015-11-11 04:04:20.533 EST] [DatabaseStorageAttributes.addRedoLogGroup:305] new id redoGroup 2

    [main] [2015-11-11 04:04:20.533 EST] RedoGroups [DatabaseStorageAttributes.addRedoLogGroup:310] 1

    [main] [2015-11-11 04:04:20.533 EST] [DatabaseStorageAttributes.addRedoLogGroup:321] arRedoGroups: [1, 2] addition of the thread id 1

    [main] [2015-11-11 04:04:20.534 EST] [DatabaseStorageAttributes.addRedoLogGroup:269]  ThreadID = 1 course

    [main] [2015-11-11 04:04:20.534 EST] [DatabaseStorageAttributes.addRedoLogGroup:270] newThread threadID = 1

    [main] [2015-11-11 04:04:20.534 EST] RedoGroups.length [DatabaseStorageAttributes.addRedoLogGroup:303] 2

    [main] [2015-11-11 04:04:20.534 EST] [DatabaseStorageAttributes.addRedoLogGroup:305] new id redoGroup 3

    [main] [2015-11-11 04:04:20.535 EST] RedoGroups [DatabaseStorageAttributes.addRedoLogGroup:310] 1

    [main] [2015-11-11 04:04:20.535 EST] RedoGroups [DatabaseStorageAttributes.addRedoLogGroup:310] 2

    [main] [2015-11-11 04:04:20.535 EST] [DatabaseStorageAttributes.addRedoLogGroup:321] arRedoGroups: [1, 2, 3] addition of the thread id 1

    [main] [2015-11-11 04:04:20.535 EST] [TemplateManager.getParsedAttributes:1710] is the model a false CBD

    [main] [2015-11-11 04:04:20.536 EST] [Check .getDatabaseSize: 2543]  DataFile Clone: sysaux01.dbf size: 560,0

    [main] [2015-11-11 04:04:20.536 EST] [Check .getDatabaseSize: 2543]  DataFile Clone: system01.dbf size: 780,0

    [main] [2015-11-11 04:04:20.536 EST] [Check .getDatabaseSize: 2543]  DataFile Clone: undotbs01.dbf size: 25.0

    [main] [2015-11-11 04:04:20.536 EST] [Check .getDatabaseSize: 2543]  DataFile Clone: users01.dbf size: 5.0

    [main] [2015-11-11 04:04:20.536 EST] [Check .getControlfFileSizes: 2868]  Control files lol: = 2

    [main] [2015-11-11 04:04:20.536 EST] [Check .getDatabaseSize: 2595] dbSize: redoLogSize 1402880: ctrlFileSize 153600: 40

    [main] [2015-11-11 04:04:20.537 EST] [TemplateManager.getParsedAttributes:1772]  DB_RECOVERY_FILE_SIZE layout to the default size: 4560

    [main] [2015-11-11 04:04:20.537 EST] [TemplateManager.getParsedAttributes:1778]  Real dynamics of FRA

    [main] [2015-11-11 04:04:20.537 EST] [TemplateManager.parseCloneTemplate:1353]  See for portable data files in TemplateManager...

    [main] [2015-11-11 04:04:20.538 EST] SetupOIDCommandlineParameters [Host.setupOIDCommandlineParameters:9418]:

    [main] [2015-11-11 04:04:20.538 EST] M_regWithdirService [Host.setupOIDCommandlineParameters:9419]: false

    [main] [2015-11-11 04:04:20.538 EST] M_unregWithdirService [Host.setupOIDCommandlineParameters:9420]: false

    [main] [2015-11-11 04:04:20.538 EST] M_updateDirService [Host.setupOIDCommandlineParameters:9421]: false

    [main] [2015-11-11 04:04:20.538 EST] SetDataBaseType [Host.startOperation:2789]

    [main] [2015-11-11 04:04:20.538 EST] [Host.startOperation:2872] is false model CBD

    [main] [2015-11-11 04:04:20.539 EST] [TemplateManager.isInstallTemplate:2348]  Selected by the user of the model: = general purpose

    [main] [2015-11-11 04:04:20.539 EST] [TemplateManager.isInstallTemplate:2355]  The Message to search for Id: = GENERAL_PURPOSE

    [main] [2015-11-11 04:04:20.540 EST] [CommonAttributes.replaceVariables:1402] var2/u01/app/oracle

    [main] [2015-11-11 04:04:20.540 EST] [CommonAttributes.replaceVariables:1402] cdb1 var2

    [main] [2015-11-11 04:04:20.541 EST] [Host.startOperation:2990]  Adding user tablesapce for pdb1

    [main] [2015-11-11 04:04:20.543 EST] [PluggableDatabaseUtils.populateDefaultUserTablespaceAttr:1018]  Creating user datafile=/u01/app/oracle/oradata/cdb1/{PDB_NAME}/{PDB_NAME}_users01.dbf

    [main] [2015-11-11 04:04:20.544 EST] [HAUtils.getCurrentOracleHome:593]  Home of the Oracle system property: /u01/app/oracle/product/12.1.0.2/db_1

    [main] [2015-11-11 04:04:20.544 EST] [HAUtils.getConfiguredGridHome:1343] - HOUSE of CRS.

    [main] [2015-11-11 04:04:20.544 EST] [UnixSystem.getCRSHome:2878] olrFileName = /etc/oracle/olr.loc

    [main] [2015-11-11 04:04:20.544 EST] [HAUtils.getHASHome:1500]  Could not get at home.

    PRCI-1144: Impossible to retrieve the path home Oracle Grid Infrastructure

    PRKC-1144: File ' / etc/oracle/olr.loc ' not found.

    [main] [2015-11-11 04:04:20.544 EST] [HADatabaseUtils.isGridMgmtDB:2842]  Mgmt DBName srvm _mgmtdb

    [main] [2015-11-11 04:04:20.545 EST] [Check .processRawConfigFile: 2991]  StorageType == 0

    [main] [2015-11-11 04:04:20.545 EST] [SilentHost.performOperation:458] processRawConfigFile = true

    [main] [2015-11-11 04:04:20.546 EST] [Host.initializeValidationContext:1255] sid, uniquenname, domain defined in validationcontextcdb1 cdb1, cdb1,.

    [main] [2015-11-11 04:04:20.546 EST] [Check .getStorageDataForValidation: 4935]  Enter getStorageDataForValidation

    [main] [2015-11-11 04:04:20.550 EST] [HAUtils.getCurrentOracleHome:593]  Home of the Oracle system property: /u01/app/oracle/product/12.1.0.2/db_1

    [main] [2015-11-11 04:04:20.550 EST] [HAUtils.getConfiguredGridHome:1343] - HOUSE of CRS.

    [main] [2015-11-11 04:04:20.550 EST] [UnixSystem.getCRSHome:2878] olrFileName = /etc/oracle/olr.loc

    [main] [2015-11-11 04:04:20.550 EST] [HAUtils.getHASHome:1500]  Could not get at home.

    PRCI-1144: Impossible to retrieve the path home Oracle Grid Infrastructure

    PRKC-1144: File ' / etc/oracle/olr.loc ' not found.

    [main] [2015-11-11 04:04:20.550 EST] [ASMUtils.initialize:247]  ASMHome: null

    [main] [2015-11-11 04:04:20.556 EST] [KfodUtil.kfodOutput:361] null/rdbms/bin/kfod

    [main] [2015-11-11 04:04:20.556 EST] [KfodUtil.kfodOutput:361] nohdr = TRUE

    [main] [2015-11-11 04:04:20.556 EST] [KfodUtil.kfodOutput:361]  OP = GROUPS

    [main] [2015-11-11 04:04:20.556 EST] Status [KfodUtil.kfodOutput:361] = true

    [main] [2015-11-11 04:04:20.556 EST] [KfodUtil.kfodOutput:361] asmcompatibility = true dbcompatibility = true

    [main] [2015-11-11 04:04:20.557 EST] [KfodUtil.kfodOutput:368]  Can not run the program "null/rdbms/bin/kfod": java.io.IOException: error = 2, no such file or directory

    [main] [2015-11-11 04:04:20.557 EST] [KfodUtil.kfodOutput:369]  Can not run the program "null/rdbms/bin/kfod": java.io.IOException: error = 2, no such file or directory

    java.lang.ProcessBuilder.processException(ProcessBuilder.java:478)

    java.lang.ProcessBuilder.start(ProcessBuilder.java:457)

    java.lang.Runtime.exec(Runtime.java:593)

    java.lang.Runtime.exec(Runtime.java:466)

    oracle.sysman.assistants.util.OsUtilsBase.execProg(OsUtilsBase.java:2300)

    oracle.sysman.assistants.util.OsUtilsBase.execProgNReturnOutput(OsUtilsBase.java:2448)

    oracle.sysman.assistants.util.KfodUtil.kfodOutput(KfodUtil.java:364)

    oracle.sysman.assistants.util.KfodUtil.kfodOutput(KfodUtil.java:254)

    oracle.sysman.assistants.util.KfodUtil.getDiskgroupsWithCompatibilityValues(KfodUtil.java:569)

    oracle.sysman.assistants.util.asm.ASMUtils.loadDiskGroups(ASMUtils.java:1040)

    oracle.sysman.assistants.util.asm.ASMUtils.initialize(ASMUtils.java:277)

    oracle.sysman.assistants.util.asm.ASMUtils.getASMUtils(ASMUtils.java:192)

    oracle.sysman.assistants.dbca.backend.Verifier.initASMDGSpace(Verifier.java:3572)

    oracle.sysman.assistants.dbca.backend.Verifier.initialiseStorageValidationData(Verifier.java:3560)

    oracle.sysman.assistants.dbca.backend.Verifier.getStorageDataForValidation(Verifier.java:4936)

    oracle.sysman.assistants.dbca.backend.Host.initializeValidationContext(Host.java:1402)

    oracle.sysman.assistants.dbca.backend.SilentHost.performOperation(SilentHost.java:460)

    oracle.sysman.assistants.dbca.backend.Host.startOperation(Host.java:3804)

    oracle.sysman.assistants.dbca.Dbca.execute(Dbca.java:153)

    oracle.sysman.assistants.dbca.Dbca.main (Dbca.java:226)

    java.lang.ProcessBuilder.processException(ProcessBuilder.java:478)

    java.lang.ProcessBuilder.start(ProcessBuilder.java:457)

    java.lang.Runtime.exec(Runtime.java:593)

    java.lang.Runtime.exec(Runtime.java:466)

    oracle.sysman.assistants.util.OsUtilsBase.execProg(OsUtilsBase.java:2300)

    oracle.sysman.assistants.util.OsUtilsBase.execProgNReturnOutput(OsUtilsBase.java:2448)

    oracle.sysman.assistants.util.KfodUtil.kfodOutput(KfodUtil.java:364)

    oracle.sysman.assistants.util.KfodUtil.kfodOutput(KfodUtil.java:254)

    oracle.sysman.assistants.util.KfodUtil.getDiskgroupsWithCompatibilityValues(KfodUtil.java:569)

    oracle.sysman.assistants.util.asm.ASMUtils.loadDiskGroups(ASMUtils.java:1040)

    oracle.sysman.assistants.util.asm.ASMUtils.initialize(ASMUtils.java:277)

    oracle.sysman.assistants.util.asm.ASMUtils.getASMUtils(ASMUtils.java:192)

    oracle.sysman.assistants.dbca.backend.Verifier.initASMDGSpace(Verifier.java:3572)

    oracle.sysman.assistants.dbca.backend.Verifier.initialiseStorageValidationData(Verifier.java:3560)

    oracle.sysman.assistants.dbca.backend.Verifier.getStorageDataForValidation(Verifier.java:4936)

    oracle.sysman.assistants.dbca.backend.Host.initializeValidationContext(Host.java:1402)

    oracle.sysman.assistants.dbca.backend.SilentHost.performOperation(SilentHost.java:460)

    oracle.sysman.assistants.dbca.backend.Host.startOperation(Host.java:3804)

    oracle.sysman.assistants.dbca.Dbca.execute(Dbca.java:153)

    oracle.sysman.assistants.dbca.Dbca.main (Dbca.java:226)

    [main] [2015-11-11 04:04:20.558 EST] [KfodUtil.kfodOutput:372]  KFOD null result

    [main] [2015-11-11 04:04:20.558 EST] [Check .initASMDGSpace: 3578] omfLocation = null

    [main] [2015-11-11 04:04:20.558 EST] [Check .initASMDGSpace: 3591]  ControlFile name {ORACLE_BASE} /oradata/ {DB_UNIQUE_NAME} /.

    [main] [2015-11-11 04:04:20.558 EST] [Check .initASMDGSpace: 3591]  ControlFile name {ORACLE_BASE} /fast_recovery_area/ {DB_UNIQUE_NAME} /.

    [main] [2015-11-11 04:04:20.559 EST] [Check .initASMDGSpace: 3612] datafile name {ORACLE_BASE} /oradata/ {DB_UNIQUE_NAME} /.

    [main] [2015-11-11 04:04:20.560 EST] [Check .initASMDGSpace: 3612] datafile name {ORACLE_BASE} /oradata/ {DB_UNIQUE_NAME} /.

    [main] [2015-11-11 04:04:20.560 EST] [Check .initASMDGSpace: 3612] datafile name {ORACLE_BASE} /oradata/ {DB_UNIQUE_NAME} /.

    [main] [2015-11-11 04:04:20.561 EST] [Check .initASMDGSpace: 3612] datafile name {ORACLE_BASE} /oradata/ {DB_UNIQUE_NAME} /.

    [main] [2015-11-11 04:04:20.561 EST] [Check .initASMDGSpace: 3622]  Adding an extra 80 for cancellation of TBS

    [main] [2015-11-11 04:04:20.561 EST] [Check .initASMDGSpace: 3781]  Skip this redolog as its not on ASM

    [main] [2015-11-11 04:04:20.561 EST] [Check .initASMDGSpace: 3781]  Skip this redolog as its not on ASM

    [main] [2015-11-11 04:04:20.561 EST] [Check .initASMDGSpace: 3781]  Skip this redolog as its not on ASM

    [main] [2015-11-11 04:04:20.561 EST] [HADatabaseUtils.isGridMgmtDB:2842]  Mgmt DBName srvm _mgmtdb

    [main] [2015-11-11 04:04:20.562 EST] [Check .initASMDGSpace: 3823]  Passwowd compatible file check for MGMTDB/sidb jump

    [main] [2015-11-11 04:04:20.562 EST] [Check .initASMDGSpace: 3878] dbRecAreaSize0 vertrue {ORACLE_BASE} / fast_recovery_area

    [main] [2015-11-11 04:04:20.562 EST] DbRecAreaSizever4560 [check .initASMDGSpace: 3884]

    [main] [2015-11-11 04:04:20.562 EST] [Check .initASMDGSpace: 3938]  Output getStorageDataForValidation

    [main] [2015-11-11 04:04:20.562 EST] [Check .initFSSpace: 4421] omfLocation = null

    [main] [2015-11-11 04:04:20.563 EST] [Check .initFSSpace: 4442]  Enter newCalculateCloneDatafilePathsAndSizes

    [main] [2015-11-11 04:04:20.563 EST] [CommonAttributes.replaceVariables:1402] var2/u01/app/oracle

    [main] [2015-11-11 04:04:20.563 EST] [CommonAttributes.replaceVariables:1402] cdb1 var2

    [main] [2015-11-11 04:04:20.563 EST] [Check .initFSSpace: 4483] clone /u01/app/oracle/oradata/cdb1/sysaux01.dbf 573440

    [main] [2015-11-11 04:04:20.563 EST] [Check .updateSizeMap: 4905] canonicalPath = / u01/app/oracle/oradata/cdb1 /.

    [main] [2015-11-11 04:04:20.564 EST] [Check .updateSizeMap: 4918]  Addition of the size required for/u01/app/oracle/oradata/cdb1/to 560

    [main] [2015-11-11 04:04:20.564 EST] [CommonAttributes.replaceVariables:1402] var2/u01/app/oracle

    [main] [2015-11-11 04:04:20.564 EST] [CommonAttributes.replaceVariables:1402] cdb1 var2

    [main] [2015-11-11 04:04:20.564 EST] [Check .initFSSpace: 4483] clone /u01/app/oracle/oradata/cdb1/system01.dbf 798720

    [main] [2015-11-11 04:04:20.564 EST] [Check .updateSizeMap: 4905] canonicalPath = / u01/app/oracle/oradata/cdb1 /.

    [main] [2015-11-11 04:04:20.565 EST] [Check .updateSizeMap: 4911]  Update of the size required for/u01/app/oracle/oradata/cdb1/to 1340

    [main] [2015-11-11 04:04:20.565 EST] [CommonAttributes.replaceVariables:1402] var2/u01/app/oracle

    [main] [2015-11-11 04:04:20.565 EST] [CommonAttributes.replaceVariables:1402] cdb1 var2

    [main] [2015-11-11 04:04:20.565 EST] [Check .initFSSpace: 4483] clone /u01/app/oracle/oradata/cdb1/undotbs01.dbf 25600

    [main] [2015-11-11 04:04:20.565 EST] [Check .updateSizeMap: 4905] canonicalPath = / u01/app/oracle/oradata/cdb1 /.

    [main] [2015-11-11 04:04:20.565 EST] [Check .updateSizeMap: 4911]  Update of the size required for/u01/app/oracle/oradata/cdb1/to 1365

    [main] [2015-11-11 04:04:20.566 EST] [CommonAttributes.replaceVariables:1402] var2/u01/app/oracle

    [main] [2015-11-11 04:04:20.566 EST] [CommonAttributes.replaceVariables:1402] cdb1 var2

    [main] [2015-11-11 04:04:20.566 EST] [Check .initFSSpace: 4483] clone /u01/app/oracle/oradata/cdb1/users01.dbf 5120

    [main] [2015-11-11 04:04:20.566 EST] [Check .updateSizeMap: 4905] canonicalPath = / u01/app/oracle/oradata/cdb1 /.

    [main] [2015-11-11 04:04:20.566 EST] [Check .updateSizeMap: 4911]  Update of the size required for/u01/app/oracle/oradata/cdb1/to 1370

    [main] [2015-11-11 04:04:20.566 EST] [CommonAttributes.replaceVariables:1402] var2/u01/app/oracle

    [main] [2015-11-11 04:04:20.567 EST] [CommonAttributes.replaceVariables:1402] cdb1 var2

    [main] [2015-11-11 04:04:20.567 EST] [Check .initFSSpace: 4483] clone /u01/app/oracle/oradata/cdb1/temp01.dbf 61440

    [main] [2015-11-11 04:04:20.567 EST] [Check .updateSizeMap: 4905] canonicalPath = / u01/app/oracle/oradata/cdb1 /.

    [main] [2015-11-11 04:04:20.567 EST] [Check .updateSizeMap: 4911]  Update of the size required for/u01/app/oracle/oradata/cdb1/to 1430

    [main] [2015-11-11 04:04:20.567 EST] [Check .initFSSpace: 4488]  Adding an extra 80 for cancellation of TBS

    [main] [2015-11-11 04:04:20.567 EST] [Check .updateSizeMap: 4923]  Invalid filepath = {ORACLE_BASE} /oradata/ {DB_UNIQUE_NAME} /.

    [main] [2015-11-11 04:04:20.568 EST] [CommonAttributes.replaceVariables:1402] var2/u01/app/oracle

    [main] [2015-11-11 04:04:20.572 EST] [CommonAttributes.replaceVariables:1402] cdb1 var2

    [main] [2015-11-11 04:04:20.572 EST] [Check .initFSSpace: 4659] redo/u01/app/oracle/oradata/cdb1/51200

    [main] [2015-11-11 04:04:20.573 EST] [Check .updateSizeMap: 4905] canonicalPath = / u01/app/oracle/oradata/cdb1 /.

    [main] [2015-11-11 04:04:20.573 EST] [Check .updateSizeMap: 4911]  Update of the size required for/u01/app/oracle/oradata/cdb1/to 1480

    [main] [2015-11-11 04:04:20.573 EST] [CommonAttributes.replaceVariables:1402] var2/u01/app/oracle

    [main] [2015-11-11 04:04:20.573 EST] [CommonAttributes.replaceVariables:1402] cdb1 var2

    [main] [2015-11-11 04:04:20.573 EST] [Check .initFSSpace: 4659] redo/u01/app/oracle/oradata/cdb1/51200

    [main] [2015-11-11 04:04:20.573 EST] [Check .updateSizeMap: 4905] canonicalPath = / u01/app/oracle/oradata/cdb1 /.

    [main] [2015-11-11 04:04:20.573 EST] [Check .updateSizeMap: 4911]  Update of the size required for/u01/app/oracle/oradata/cdb1/to 1530

    [main] [2015-11-11 04:04:20.574 EST] [CommonAttributes.replaceVariables:1402] var2/u01/app/oracle

    [main] [2015-11-11 04:04:20.574 EST] [CommonAttributes.replaceVariables:1402] cdb1 var2

    [main] [2015-11-11 04:04:20.574 EST] [Check .initFSSpace: 4659] redo/u01/app/oracle/oradata/cdb1/51200

    [main] [2015-11-11 04:04:20.574 EST] [Check .updateSizeMap: 4905] canonicalPath = / u01/app/oracle/oradata/cdb1 /.

    [main] [2015-11-11 04:04:20.574 EST] [Check .updateSizeMap: 4911]  Update of the size required for/u01/app/oracle/oradata/cdb1/to 1580

    [main] [2015-11-11 04:04:20.574 EST] [CommonAttributes.replaceVariables:1402] var2/u01/app/oracle

    [main] [2015-11-11 04:04:20.575 EST] [CommonAttributes.replaceVariables:1402] cdb1 var2

    [main] [2015-11-11 04:04:20.575 EST] [Check .initFSSpace: 4691] contrl and buffer/u01/app/oracle/oradata/cdb1/120

    [main] [2015-11-11 04:04:20.575 EST] [Check .updateSizeMap: 4905] canonicalPath = / u01/app/oracle/oradata/cdb1 /.

    [main] [2015-11-11 04:04:20.575 EST] [Check .updateSizeMap: 4911]  Update of the size required for/u01/app/oracle/oradata/cdb1/to 1580

    [main] [2015-11-11 04:04:20.575 EST] [CommonAttributes.replaceVariables:1402] var2/u01/app/oracle

    [main] [2015-11-11 04:04:20.575 EST] [CommonAttributes.replaceVariables:1402] cdb1 var2

    [main] [2015-11-11 04:04:20.575 EST] [Check .initFSSpace: 4691] contrl and buffer/u01/app/oracle/fast_recovery_area/cdb1/120

    [main] [2015-11-11 04:04:20.576 EST] [Check .updateSizeMap: 4905] canonicalPath = / u01/app/oracle/fast_recovery_area/cdb1 /.

    [main] [2015-11-11 04:04:20.576 EST] [Check .updateSizeMap: 4918]  Addition of the size required for/u01/app/oracle/fast_recovery_area/cdb1/0

    [main] [2015-11-11 04:04:20.576 EST] [CommonAttributes.replaceVariables:1402] var2/u01/app/oracle

    [main] [2015-11-11 04:04:20.576 EST] [CommonAttributes.replaceVariables:1402] cdb1 var2

    [main] [2015-11-11 04:04:20.576 EST] [Check .initFSSpace: 4707]  Path of file to default data for CBD = / u01/app/oracle/oradata/cdb1

    [main] [2015-11-11 04:04:20.582 EST] AttributeList.size ([TarUtil.loadMetaDataInfo:452]) 3

    [main] [2015-11-11 04:04:20.583 EST] [Check .initFSSpace: 4726] APB datafile: /oradata/seeddata/pdbseed/system01.dbf size: 250

    [main] [2015-11-11 04:04:20.589 EST] [Check .initFSSpace: 4726] APB datafile: /oradata/seeddata/pdbseed/sysaux01.dbf size: 490

    [main] [2015-11-11 04:04:20.589 EST] [Check .initFSSpace: 4726] APB datafile: /oradata/seeddata/pdbseed/temp01.dbf size: 20

    [main] [2015-11-11 04:04:20.589 EST] [Check .initFSSpace: 4736]  Total size of all data calculated from the pdbseed xml files is: 760

    [main] [2015-11-11 04:04:20.590 EST] [Check .initFSSpace: 4753]  The total size of PDB update for: 1525

    [main] [2015-11-11 04:04:20.590 EST] [CommonAttributes.replaceVariables:1402] var2/u01/app/oracle

    [main] [2015-11-11 04:04:20.590 EST] [Check .initFSSpace: 4828] canonicalPathForFra = / u01/app/oracle/fast_recovery_area /.

    [main] [2015-11-11 04:04:20.590 EST] [Check .initFSSpace: 4859]  Adding path: /u01/app/oracle/oradata/cdb1/sysaux01.dbf for the file existence check

    [main] [2015-11-11 04:04:20.590 EST] [Check .initFSSpace: 4859]  Adding path: /u01/app/oracle/oradata/cdb1/system01.dbf for the file existence check

    [main] [2015-11-11 04:04:20.591 EST] [Check .initFSSpace: 4859]  Adding path: /u01/app/oracle/oradata/cdb1/undotbs01.dbf for the file existence check

    [main] [2015-11-11 04:04:20.591 EST] [Check .initFSSpace: 4859]  Adding path: /u01/app/oracle/oradata/cdb1/users01.dbf for the file existence check

    [main] [2015-11-11 04:04:20.591 EST] [Check .initFSSpace: 4859]  Adding path: /u01/app/oracle/oradata/cdb1/temp01.dbf for the file existence check

    [main] [2015-11-11 04:04:20.591 EST] [Check .initFSSpace: 4862]  Output getStorageDataForValidation

    [main] [2015-11-11 04:04:20.591 EST] [SilentHost.performOperation:461] after initialization to silent mode validation context

    [main] [2015-11-11 04:04:20.648 EST] [ClusterVerification.getInstance:396]  The method entry

    [main] [2015-11-11 04:04:20.653 EST] [ParamManager. < init >: 668] m_paramInstantiated set to TRUE

    [main] [2015-11-11 04:04:20.653 EST] [VerificationUtil.getLocalHost:1312]  Hostname retrieved: ip-172-31-22-120.us-west-2.compute.internal returned: ip-172-31-22-120

    [main] [2015-11-11 04:04:20.654 EST] [Version.isPre:610] version to be checked 12.1.0.2.0 version to check against 10 main

    [main] [2015-11-11 04:04:20.654 EST] IsPre.java [Version.isPre:621]: return FALSE

    [main] [2015-11-11 04:04:20.654 EST] [Version.isPre:610] version to be checked 12.1.0.2.0 version to check against 10 main

    [main] [2015-11-11 04:04:20.655 EST] IsPre.java [Version.isPre:621]: return FALSE

    [main] [2015-11-11 04:04:20.655 EST] [VerificationUtil.isCRSConfigured:4209] crsConfigured = false

    [main] [2015-11-11 04:04:20.655 EST] [Version.isPre:610] version to be checked 12.1.0.2.0 version to check against 10 main

    [main] [2015-11-11 04:04:20.655 EST] IsPre.java [Version.isPre:621]: return FALSE

    [main] [2015-11-11 04:04:20.655 EST] [Version.isPre:610] version to be checked 12.1.0.2.0 version to check against 10 main

    [main] [2015-11-11 04:04:20.655 EST] IsPre.java [Version.isPre:621]: return FALSE

    [main] [2015-11-11 04:04:20.656 EST] [Version.isPre:610] version to be checked 12.1.0.2.0 version to check against 11 main

    [main] [2015-11-11 04:04:20.656 EST] IsPre.java [Version.isPre:621]: return FALSE

    [main] [2015-11-11 04:04:20.656 EST] [Version.isPre:642] version to be checked 12.1.0.2.0 version to check against 11 minor version to check against 2 main

    [main] [2015-11-11 04:04:20.656 EST] [Version.isPre:651] isPre: return FALSE for major version control

    [main] [2015-11-11 04:04:20.656 EST] [UnixSystem.isHAConfigured:2788] olrFileName = /etc/oracle/olr.loc

    [main] [2015-11-11 04:04:20.656 EST] [VerificationUtil.isHAConfigured:4181] haConfigured = false

    [main] [2015-11-11 04:04:20.674 EST] [Check .validateMemory: 1219]  Audit exception: the default location for home is not available. It must be specified

    [main] [2015-11-11 04:04:20.674 EST] [ClusterVerification.getInstance:396]  The method entry

    [main] [2015-11-11 04:04:20.675 EST] [VerificationUtil.getLocalHost:1312]  Hostname retrieved: ip-172-31-22-120.us-west-2.compute.internal returned: ip-172-31-22-120

    [main] [2015-11-11 04:04:20.675 EST] [Version.isPre:610] version to be checked 12.1.0.2.0 version to check against 10 main

    [main] [2015-11-11 04:04:20.675 EST] IsPre.java [Version.isPre:621]: return FALSE

    [main] [2015-11-11 04:04:20.675 EST] [Version.isPre:610] version to be checked 12.1.0.2.0 version to check against 10 main

    [main] [2015-11-11 04:04:20.675 EST] IsPre.java [Version.isPre:621]: return FALSE

    [main] [2015-11-11 04:04:20.675 EST] [VerificationUtil.isCRSConfigured:4209] crsConfigured = false

    [main] [2015-11-11 04:04:20.676 EST] [Version.isPre:610] version to be checked 12.1.0.2.0 version to check against 10 main

    [main] [2015-11-11 04:04:20.676 EST] IsPre.java [Version.isPre:621]: return FALSE

    [main] [2015-11-11 04:04:20.676 EST] [Version.isPre:610] version to be checked 12.1.0.2.0 version to check against 10 main

    [main] [2015-11-11 04:04:20.676 EST] IsPre.java [Version.isPre:621]: return FALSE

    [main] [2015-11-11 04:04:20.676 EST] [Version.isPre:610] version to be checked 12.1.0.2.0 version to check against 11 main

    [main] [2015-11-11 04:04:20.676 EST] IsPre.java [Version.isPre:621]: return FALSE

    [main] [2015-11-11 04:04:20.677 EST] [Version.isPre:642] version to be checked 12.1.0.2.0 version to check against 11 minor version to check against 2 main

    [main] [2015-11-11 04:04:20.677 EST] [Version.isPre:651] isPre: return FALSE for major version control

    [main] [2015-11-11 04:04:20.677 EST] [UnixSystem.isHAConfigured:2788] olrFileName = /etc/oracle/olr.loc

    [main] [2015-11-11 04:04:20.677 EST] [VerificationUtil.isHAConfigured:4181] haConfigured = false

    [main] [2015-11-11 04:04:20.677 EST] [Check .validateSGA: 1248]  Audit exception: the default location for home is not available. It must be specified

    [main] [2015-11-11 04:04:20.677 EST] True checkUnified [check .validateSharedPoolSize: 1273]

    [main] [2015-11-11 04:04:20.678 EST] [Check .validateSharedPoolSize: 1274] checkUnified 415236096

    [main] [2015-11-11 04:04:20.678 EST] [HAUtils.getCurrentOracleHome:593]  Home of the Oracle system property: /u01/app/oracle/product/12.1.0.2/db_1

    [main] [2015-11-11 04:04:20.678 EST] [HAUtils.getConfiguredGridHome:1343] - HOUSE of CRS.

    [main] [2015-11-11 04:04:20.678 EST] [UnixSystem.getCRSHome:2878] olrFileName = /etc/oracle/olr.loc

    [main] [2015-11-11 04:04:20.678 EST] [HAUtils.getHASHome:1500]  Could not get at home.

    PRCI-1144: Impossible to retrieve the path home Oracle Grid Infrastructure

    PRKC-1144: File ' / etc/oracle/olr.loc ' not found.

    [main] [2015-11-11 04:04:20.679 EST] Call validatebackend [Host.validate:5345]

    [main] [2015-11-11 04:04:20.679 EST] ValidateBackend departure [check .validateBackend: 1026]

    [main] [2015-11-11 04:04:20.680 EST] [DBCAValidator.loadCreateDBValidationGroups:400] run TR db validations

    [main] [2015-11-11 04:04:20.681 EST] [Host.noEntryinOratab:7194]  Check for oratab arg passed...

    [main] [2015-11-11 04:04:20.681 EST] [DBCAValidator.loadCreateDBValidationGroups:403] jump dbid validatoin for if

    [main] [2015-11-11 04:04:20.681 EST] False isCluster [DBCAValidator.loadCreateDBValidationGroups:415]

    [main] [2015-11-11 04:04:20.681 EST] False isHARegnReq [DBCAValidator.loadCreateDBValidationGroups:416]

    [main] [2015-11-11 04:04:20.685 EST] Iscdb1 gdbname [DBIdentificationHelper.getDbNameError:224]

    [main] [2015-11-11 04:04:20.711 EST] [Check .validateBackend: 1033]  The result of the validation:

    Checking database unique identifier passed.

    [main] [2015-11-11 04:04:20.711 EST] [Check .validateBackend: 1058] writing true trace result

    [main] [2015-11-11 04:04:20.713 EST] [StorageSpaceCheck.validate:97]  Get volumes of spatial maps 3, 1

    [main] [2015-11-11 04:04:20.713 EST] [StorageSpaceCheck.getConsolidatedMap:312] locationString processed: / u01/app/oracle/oradata/cdb1 original String: / u01/app/oracle/oradata/cdb1 /.

    [main] [2015-11-11 04:04:20.713 EST] [HAUtils.getCurrentOracleHome:593]  Home of the Oracle system property: /u01/app/oracle/product/12.1.0.2/db_1

    [main] [2015-11-11 04:04:20.713 EST] [HAUtils.getConfiguredGridHome:1343] - HOUSE of CRS.

    [main] [2015-11-11 04:04:20.713 EST] [UnixSystem.getCRSHome:2878] olrFileName = /etc/oracle/olr.loc

    [main] [2015-11-11 04:04:20.714 EST] [HAUtils.getHASHome:1500]  Could not get at home.

    PRCI-1144: Impossible to retrieve the path home Oracle Grid Infrastructure

    PRKC-1144: File ' / etc/oracle/olr.loc ' not found.

    [main] [2015-11-11 04:04:20.714 EST] IsPathOnACFS [HAUtils.isPathOnACFS:3995]: false

    [main] [2015-11-11 04:04:20.832 EST] [OsUtilsBase.getMountPoint:2822] mount point to be checked/sys/kernel/security /.

    [main] [2015-11-11 04:04:20.833 EST] [OsUtilsBase.getMountPoint:2822] mount point to be checked/sys/kernel/debug /.

    [main] [2015-11-11 04:04:20.833 EST] [OsUtilsBase.getMountPoint:2822] mount point to be checked/sys/kernel/config /.

    [main] [2015-11-11 04:04:20.834 EST] [OsUtilsBase.getMountPoint:2822] mount point to be checked/sys/fs/selinux /.

    [main] [2015-11-11 04:04:20.835 EST] [OsUtilsBase.getMountPoint:2822] mount point to be checked/sys/fs/pstore.

    [main] [2015-11-11 04:04:20.835 EST] [OsUtilsBase.getMountPoint:2822] mount point to be checked/sys/fs/cgroup/systemd.

    [main] [2015-11-11 04:04:20.835 EST] [OsUtilsBase.getMountPoint:2822] mount point to be checked/sys/fs/cgroup/perf_event.

    [main] [2015-11-11 04:04:20.835 EST] [OsUtilsBase.getMountPoint:2822] mount point to be checked/sys/fs/cgroup/net_cls /.

    [main] [2015-11-11 04:04:20.835 EST] [OsUtilsBase.getMountPoint:2822] mount point to be checked/sys/fs/cgroup/memory.

    [main] [2015-11-11 04:04:20.835 EST] [OsUtilsBase.getMountPoint:2822] mount point to be checked/sys/fs/cgroup/hugetlb.

    [main] [2015-11-11 04:04:20.836 EST] [OsUtilsBase.getMountPoint:2822] mount point to be checked/sys/fs/cgroup/freezer.

    [main] [2015-11-11 04:04:20.836 EST] [OsUtilsBase.getMountPoint:2822] mount point to be checked/sys/fs/cgroup/devices /.

    [main] [2015-11-11 04:04:20.836 EST] [OsUtilsBase.getMountPoint:2822] mount point to be checked/sys/fs/cgroup/cpuset.

    [main] [2015-11-11 04:04:20.836 EST] [OsUtilsBase.getMountPoint:2822] mount point to be checked/sys/fs/cgroup/cpu, cpuacct.

    [main] [2015-11-11 04:04:20.836 EST] [OsUtilsBase.getMountPoint:2822] mount point to be checked/sys/fs/cgroup/blkio /.

    [main] [2015-11-11 04:04:20.836 EST] [OsUtilsBase.getMountPoint:2822] mount point to be checked/sys/fs/cgroup /.

    [main] [2015-11-11 04:04:20.836 EST] [OsUtilsBase.getMountPoint:2822] mount point to be checked /sys/

    [main] [2015-11-11 04:04:20.837 EST] [OsUtilsBase.getMountPoint:2822] mount point to be checked /run/

    [main] [2015-11-11 04:04:20.837 EST] [OsUtilsBase.getMountPoint:2822] mount point to be checked/proc/sys/fs/binfmt_misc /.

    [main] [2015-11-11 04:04:20.837 EST] [OsUtilsBase.getMountPoint:2822] mount point to be checked/proc/sys/fs/binfmt_misc /.

    [main] [2015-11-11 04:04:20.837 EST] [OsUtilsBase.getMountPoint:2822] mount point to be checked/proc /.

    [main] [2015-11-11 04:04:20.837 EST] [OsUtilsBase.getMountPoint:2822] mount point to be checked/dev/shm /.

    [main] [2015-11-11 04:04:20.837 EST] [OsUtilsBase.getMountPoint:2822] mount point to be checked/dev/pts /.

    [main] [2015-11-11 04:04:20.837 EST] [OsUtilsBase.getMountPoint:2822] mount point to be checked/dev/mqueue /.

    [main] [2015-11-11 04:04:20.838 EST] [OsUtilsBase.getMountPoint:2822] mount point to be checked/dev/hugepages.

    [main] [2015-11-11 04:04:20.838 EST] [OsUtilsBase.getMountPoint:2822] mount point to be checked/dev /.

    [main] [2015-11-11 04:04:20.838 EST] [OsUtilsBase.getMountPoint:2822] mount at check point.

    [main] [2015-11-11 04:04:20.838 EST] [StorageSpaceCheck.getConsolidatedMap:341]  Point/u01/app/oracle/oradata/cdb1 of editing/is /.

    [main] [2015-11-11 04:04:20.838 EST] [StorageSpaceCheck.getConsolidatedMap:312] locationString processed: / u01/app/oracle/oradata/cdb1 original String: / u01/app/oracle/oradata/cdb1

    [main] [2015-11-11 04:04:20.838 EST] [HAUtils.getCurrentOracleHome:593]  Home of the Oracle system property: /u01/app/oracle/product/12.1.0.2/db_1

    [main] [2015-11-11 04:04:20.838 EST] [HAUtils.getConfiguredGridHome:1343] - HOUSE of CRS.

    [main] [2015-11-11 04:04:20.839 EST] [UnixSystem.getCRSHome:2878] olrFileName = /etc/oracle/olr.loc

    [main] [2015-11-11 04:04:20.839 EST] [HAUtils.getHASHome:1500]  Could not get at home.

    PRCI-1144: Impossible to retrieve the path home Oracle Grid Infrastructure

    PRKC-1144: File ' / etc/oracle/olr.loc ' not found.

    [main] [2015-11-11 04:04:20.839 EST] IsPathOnACFS [HAUtils.isPathOnACFS:3995]: false

    [main] [2015-11-11 04:04:20.853 EST] [OsUtilsBase.getMountPoint:2822] mount point to be checked/sys/kernel/security /.

    [main] [2015-11-11 04:04:20.853 EST] [OsUtilsBase.getMountPoint:2822] mount point to be checked/sys/kernel/debug /.

    [main] [2015-11-11 04:04:20.853 EST] [OsUtilsBase.getMountPoint:2822] mount point to be checked/sys/kernel/config /.

    [main] [2015-11-11 04:04:20.853 EST] [OsUtilsBase.getMountPoint:2822] mount point to be checked/sys/fs/selinux /.

    [main] [2015-11-11 04:04:20.853 EST] [OsUtilsBase.getMountPoint:2822] mount point to be checked/sys/fs/pstore.

    [main] [2015-11-11 04:04:20.853 EST] [OsUtilsBase.getMountPoint:2822] mount point to be checked/sys/fs/cgroup/systemd.

    [main] [2015-11-11 04:04:20.853 EST] [OsUtilsBase.getMountPoint:2822] mount point to be checked/sys/fs/cgroup/perf_event.

    [main] [2015-11-11 04:04:20.854 EST] [OsUtilsBase.getMountPoint:2822] mount point to be checked/sys/fs/cgroup/net_cls /.

    [main] [2015-11-11 04:04:20.854 EST] [OsUtilsBase.getMountPoint:2822] mount point to be checked/sys/fs/cgroup/memory.

    [main] [2015-11-11 04:04:20.854 EST] [OsUtilsBase.getMountPoint:2822] mount point to be checked/sys/fs/cgroup/hugetlb.

    [main] [2015-11-11 04:04:20.854 EST] [OsUtilsBase.getMountPoint:2822] mount point to be checked/sys/fs/cgroup/freezer.

    [main] [2015-11-11 04:04:20.854 EST] [OsUtilsBase.getMountPoint:2822] mount point to be checked/sys/fs/cgroup/devices /.

    [main] [2015-11-11 04:04:20.854 EST] [OsUtilsBase.getMountPoint:2822] mount point to be checked/sys/fs/cgroup/cpuset.

    [main] [2015-11-11 04:04:20.855 EST] [OsUtilsBase.getMountPoint:2822] mount point to be checked/sys/fs/cgroup/cpu, cpuacct.

    [main] [2015-11-11 04:04:20.855 EST] [OsUtilsBase.getMountPoint:2822] mount point to be checked/sys/fs/cgroup/blkio /.

    [main] [2015-11-11 04:04:20.855 EST] [OsUtilsBase.getMountPoint:2822] mount point to be checked/sys/fs/cgroup /.

    [main] [2015-11-11 04:04:20.855 EST] [OsUtilsBase.getMountPoint:2822] mount point to be checked /sys/

    [main] [2015-11-11 04:04:20.855 EST] [OsUtilsBase.getMountPoint:2822] mount point to be checked /run/

    [main] [2015-11-11 04:04:20.855 EST] [OsUtilsBase.getMountPoint:2822] mount point to be checked/proc/sys/fs/binfmt_misc /.

    [main] [2015-11-11 04:04:20.855 EST] [OsUtilsBase.getMountPoint:2822] mount point to be checked/proc/sys/fs/binfmt_misc /.

    [main] [2015-11-11 04:04:20.855 EST] [OsUtilsBase.getMountPoint:2822] mount point to be checked/proc /.

    [main] [2015-11-11 04:04:20.856 EST] [OsUtilsBase.getMountPoint:2822] mount point to be checked/dev/shm /.

    [main] [2015-11-11 04:04:20.856 EST] [OsUtilsBase.getMountPoint:2822] mount point to be checked/dev/pts /.

    [main] [2015-11-11 04:04:20.856 EST] [OsUtilsBase.getMountPoint:2822] mount point to be checked/dev/mqueue /.

    [main] [2015-11-11 04:04:20.856 EST] [OsUtilsBase.getMountPoint:2822] mount point to be checked/dev/hugepages.

    [main] [2015-11-11 04:04:20.856 EST] [OsUtilsBase.getMountPoint:2822] mount point to be checked/dev /.

    [main] [2015-11-11 04:04:20.856 EST] [OsUtilsBase.getMountPoint:2822] mount at check point.

    [main] [2015-11-11 04:04:20.856 EST] [StorageSpaceCheck.getConsolidatedMap:341]  / U01/app/oracle/oradata/cdb1 mount point is /.

    [main] [2015-11-11 04:04:20.857 EST] [StorageSpaceCheck.getConsolidatedMap:312] locationString processed: / u01/app/oracle/fast_recovery_area/cdb1 original String: / u01/app/oracle/fast_recovery_area/cdb1 /.

    [main] [2015-11-11 04:04:20.857 EST] [HAUtils.getCurrentOracleHome:593]  Home of the Oracle system property: /u01/app/oracle/product/12.1.0.2/db_1

    [main] [2015-11-11 04:04:20.857 EST] [HAUtils.getConfiguredGridHome:1343] - HOUSE of CRS.

    [main] [2015-11-11 04:04:20.857 EST] [UnixSystem.getCRSHome:2878] olrFileName = /etc/oracle/olr.loc

    [main] [2015-11-11 04:04:20.857 EST] [HAUtils.getHASHome:1500]  Could not get at home.

    PRCI-1144: Impossible to retrieve the path home Oracle Grid Infrastructure

    PRKC-1144: File ' / etc/oracle/olr.loc ' not found.

    [main] [2015-11-11 04:04:20.858 EST] IsPathOnACFS [HAUtils.isPathOnACFS:3995]: false

    [main] [2015-11-11 04:04:20.863 EST] [OsUtilsBase.getMountPoint:2822] mount point to be checked/sys/kernel/security /.

    [main] [2015-11-11 04:04:20.863 EST] [OsUtilsBase.getMountPoint:2822] mount point to be checked/sys/kernel/debug /.

    [main] [2015-11-11 04:04:20.864 EST] [OsUtilsBase.getMountPoint:2822] mount point to be checked/sys/kernel/config /.

    [main] [2015-11-11 04:04:20.864 EST] [OsUtilsBase.getMountPoint:2822] mount point to be checked/sys/fs/selinux /.

    [main] [2015-11-11 04:04:20.864 EST] [OsUtilsBase.getMountPoint:2822] mount point to be checked/sys/fs/pstore.

    [main] [2015-11-11 04:04:20.864 EST] [OsUtilsBase.getMountPoint:2822] mount point to be checked/sys/fs/cgroup/systemd.

    [main] [2015-11-11 04:04:20.864 EST] [OsUtilsBase.getMountPoint:2822] mount point to be checked/sys/fs/cgroup/perf_event.

    [main] [2015-11-11 04:04:20.864 EST] [OsUtilsBase.getMountPoint:2822] mount point to be checked/sys/fs/cgroup/net_cls /.

    [main] [2015-11-11 04:04:20.864 EST] [OsUtilsBase.getMountPoint:2822] mount point to be checked/sys/fs/cgroup/memory.

    [main] [2015-11-11 04:04:20.865 EST] [OsUtilsBase.getMountPoint:2822] mount point to be checked/sys/fs/cgroup/hugetlb.

    [main] [2015-11-11 04:04:20.865 EST] [OsUtilsBase.getMountPoint:2822] mount point to be checked/sys/fs/cgroup/freezer.

    [main] [2015-11-11 04:04:20.865 EST] [OsUtilsBase.getMountPoint:2822] mount point to be checked/sys/fs/cgroup/devices /.

    [main] [2015-11-11 04:04:20.865 EST] [OsUtilsBase.getMountPoint:2822] mount point to be checked/sys/fs/cgroup/cpuset.

    [main] [2015-11-11 04:04:20.865 EST] [OsUtilsBase.getMountPoint:2822] mount point to be checked/sys/fs/cgroup/cpu, cpuacct.

    [main] [2015-11-11 04:04:20.865 EST] [OsUtilsBase.getMountPoint:2822] mount point to be checked/sys/fs/cgroup/blkio /.

    [main] [2015-11-11 04:04:20.865 EST] [OsUtilsBase.getMountPoint:2822] mount point to be checked/sys/fs/cgroup /.

    [main] [2015-11-11 04:04:20.866 EST] [OsUtilsBase.getMountPoint:2822] mount point to be checked /sys/

    [main] [2015-11-11 04:04:20.866 EST] [OsUtilsBase.getMountPoint:2822] mount point to be checked /run/

    [main] [2015-11-11 04:04:20.866 EST] [OsUtilsBase.getMountPoint:2822] mount point to be checked/proc/sys/fs/binfmt_misc /.

    [main] [2015-11-11 04:04:20.866 EST] [OsUtilsBase.getMountPoint:2822] mount point to be checked/proc/sys/fs/binfmt_misc /.

    [main] [2015-11-11 04:04:20.866 EST] [OsUtilsBase.getMountPoint:2822] mount point to be checked/proc /.

    [main] [2015-11-11 04:04:20.866 EST] [OsUtilsBase.getMountPoint:2822] mount point to be checked/dev/shm /.

    [main] [2015-11-11 04:04:20.867 EST] [OsUtilsBase.getMountPoint:2822] mount point to be checked/dev/pts /.

    [main] [2015-11-11 04:04:20.867 EST] [OsUtilsBase.getMountPoint:2822] mount point to be checked/dev/mqueue /.

    [main] [2015-11-11 04:04:20.867 EST] [OsUtilsBase.getMountPoint:2822] mount point to be checked/dev/hugepages.

    [main] [2015-11-11 04:04:20.867 EST] [OsUtilsBase.getMountPoint:2822] mount point to be checked/dev /.

    [main] [2015-11-11 04:04:20.867 EST] [OsUtilsBase.getMountPoint:2822] mount at check point.

    [main] [2015-11-11 04:04:20.867 EST] [StorageSpaceCheck.getConsolidatedMap:341]  Point/u01/app/oracle/fast_recovery_area/cdb1 of editing/is /.

    [main] [2015-11-11 04:04:20.867 EST] [StorageSpaceCheck.getConsolidatedMap:312] locationString processed: / u01/app/oracle/fast_recovery_area original String: / u01/app/oracle/fast_recovery_area

    [main] [2015-11-11 04:04:20.868 EST] [HAUtils.getCurrentOracleHome:593]  Home of the Oracle system property: /u01/app/oracle/product/12.1.0.2/db_1

    [main] [2015-11-11 04:04:20.868 EST] [HAUtils.getConfiguredGridHome:1343] - HOUSE of CRS.

    [main] [2015-11-11 04:04:20.868 EST] [UnixSystem.getCRSHome:2878] olrFileName = /etc/oracle/olr.loc

    [main] [2015-11-11 04:04:20.868 EST] [HAUtils.getHASHome:1500]  Could not get at home.

    PRCI-1144: Impossible to retrieve the path home Oracle Grid Infrastructure

    PRKC-1144: File ' / etc/oracle/olr.loc ' not found.

    [main] [2015-11-11 04:04:20.868 EST] IsPathOnACFS [HAUtils.isPathOnACFS:3995]: false

    [main] [2015-11-11 04:04:20.872 EST] [OsUtilsBase.getMountPoint:2822] mount point to be checked/sys/kernel/security /.

    [main] [2015-11-11 04:04:20.872 EST] [OsUtilsBase.getMountPoint:2822] mount point to be checked/sys/kernel/debug /.

    [main] [2015-11-11 04:04:20.872 EST] [OsUtilsBase.getMountPoint:2822] mount point to be checked/sys/kernel/config /.

    [main] [2015-11-11 04:04:20.872 EST] [OsUtilsBase.getMountPoint:2822] mount point to be checked/sys/fs/selinux /.

    [main] [2015-11-11 04:04:20.872 EST] [OsUtilsBase.getMountPoint:2822] mount point to be checked/sys/fs/pstore.

    [main] [2015-11-11 04:04:20.872 EST] [OsUtilsBase.getMountPoint:2822] mount point to be checked/sys/fs/cgroup/systemd.

    [main] [2015-11-11 04:04:20.873 EST] [OsUtilsBase.getMountPoint:2822] mount point to be checked/sys/fs/cgroup/perf_event.

    [main] [2015-11-11 04:04:20.873 EST] [OsUtilsBase.getMountPoint:2822] mount point to be checked/sys/fs/cgroup/net_cls /.

    [main] [2015-11-11 04:04:20.873 EST] [OsUtilsBase.getMountPoint:2822] mount point to be checked/sys/fs/cgroup/memory.

    [main] [2015-11-11 04:04:20.873 EST] [OsUtilsBase.getMountPoint:2822] mount point to be checked/sys/fs/cgroup/hugetlb.

    [main] [2015-11-11 04:04:20.873 EST] [OsUtilsBase.getMountPoint:2822] mount point to be checked/sys/fs/cgroup/freezer.

    [main] [2015-11-11 04:04:20.873 EST] [OsUtilsBase.getMountPoint:2822] mount point to be checked/sys/fs/cgroup/devices /.

    [main] [2015-11-11 04:04:20.873 EST] [OsUtilsBase.getMountPoint:2822] mount point to be checked/sys/fs/cgroup/cpuset.

    [main] [2015-11-11 04:04:20.874 EST] [OsUtilsBase.getMountPoint:2822] mount point to be checked/sys/fs/cgroup/cpu, cpuacct.

    [main] [2015-11-11 04:04:20.874 EST] [OsUtilsBase.getMountPoint:2822] mount point to be checked/sys/fs/cgroup/blkio /.

    [main] [2015-11-11 04:04:20.874 EST] [OsUtilsBase.getMountPoint:2822] mount point to be checked/sys/fs/cgroup /.

    [main] [2015-11-11 04:04:20.874 EST] [OsUtilsBase.getMountPoint:2822] mount point to be checked /sys/

    [main] [2015-11-11 04:04:20.874 EST] [OsUtilsBase.getMountPoint:2822] mount point to be checked /run/

    [main] [2015-11-11 04:04:20.874 EST] [OsUtilsBase.getMountPoint:2822] mount point to be checked/proc/sys/fs/binfmt_misc /.

    [main] [2015-11-11 04:04:20.874 EST] [OsUtilsBase.getMountPoint:2822] mount point to be checked/proc/sys/fs/binfmt_misc /.

    [main] [2015-11-11 04:04:20.875 EST] [OsUtilsBase.getMountPoint:2822] mount point to be checked/proc /.

    [main] [2015-11-11 04:04:20.875 EST] [OsUtilsBase.getMountPoint:2822] mount point to be checked/dev/shm /.

    [main] [2015-11-11 04:04:20.875 EST] [OsUtilsBase.getMountPoint:2822] mount point to be checked/dev/pts /.

    [main] [2015-11-11 04:04:20.875 EST] [OsUtilsBase.getMountPoint:2822] mount point to be checked/dev/mqueue /.

    [main] [2015-11-11 04:04:20.875 EST] [OsUtilsBase.getMountPoint:2822] mount point to be checked/dev/hugepages.

    [main] [2015-11-11 04:04:20.875 EST] [OsUtilsBase.getMountPoint:2822] mount point to be checked/dev /.

    [main] [2015-11-11 04:04:20.875 EST] [OsUtilsBase.getMountPoint:2822] mount at check point.

    [main] [2015-11-11 04:04:20.876 EST] [StorageSpaceCheck.getConsolidatedMap:341]  / U01/app/oracle/fast_recovery_area mount point is /.

    [main] [2015-11-11 04:04:20.876 EST] [StorageSpaceCheck.validate:136]  Archive storage.

    [main] [2015-11-11 04:04:20.876 EST] [HAUtils.getCurrentOracleHome:593]  Home of the Oracle system property: /u01/app/oracle/product/12.1.0.2/db_1

    [main] [2015-11-11 04:04:20.876 EST] [HAUtils.getConfiguredGridHome:1343] - HOUSE of CRS.

    [main] [2015-11-11 04:04:20.876 EST] [UnixSystem.getCRSHome:2878] olrFileName = /etc/oracle/olr.loc

    [main] [2015-11-11 04:04:20.877 EST] [HAUtils.getHASHome:1500]  Could not get at home.

    PRCI-1144: Impossible to retrieve the path home Oracle Grid Infrastructure

    PRKC-1144: File ' / etc/oracle/olr.loc ' not found.

    [main] [2015-11-11 04:04:20.877 EST] IsPathOnACFS [HAUtils.isPathOnACFS:3995]: false

    [main] [2015-11-11 04:04:20.877 EST] [StorageSpaceCheck.validate:165] / isACFSMountPoint: false

    [main] [2015-11-11 04:04:20.877 EST] [StorageSpaceCheck.parseSpaceResult:385] real: 17768 location: / mandatorySpace: optionalSpace 3105: 4560

    [main] [2015-11-11 04:04:20.879 EST] [Check .validateBackend: 1033]  The result of the validation:

    / has enough space. Space required is 7665 MB, available space is 17768 MB.

    File of successful Validations.

    [main] [2015-11-11 04:04:20.879 EST] [Check .validateBackend: 1058] writing true trace result

    [main] [2015-11-11 04:04:20.879 EST] [CommonAttributes.replaceVariables:1402] /u01/app/oracle/product/12.1.0.2/db_1 var2

    [main] [2015-11-11 04:04:20.879 EST] [CommonAttributes.replaceVariables:1402] /u01/app/oracle/product/12.1.0.2/db_1 var2

    [main] [2015-11-11 04:04:20.879 EST] [Host.checkCloneJarExists:5160] /U01/app/oracle/product/12.1.0.2/db_1/assistants/dbca/templates/Seed_Database.dfb backup piece is

    [main] [2015-11-11 04:04:20.880 EST] [Host.executeSteps:5975]  Stages of execution...

    [main] [2015-11-11 04:04:20.880 EST] [HADatabaseUtils.isGridMgmtDB:2842]  Mgmt DBName srvm _mgmtdb

    [main] [2015-11-11 04:04:20.880 EST] SetUpForOperation [Host.setUpForOperation:4003]: Mode = 128

    [main] [2015-11-11 04:04:20.880 EST] [OsUtilsBase.copyFile:1505]  OsUtilsBase.copyFile:

    [main] [2015-11-11 04:04:20.882 EST] [CommonAttributes.replaceVariables:1402] var2/u01/app/oracle

    [main] [2015-11-11 04:04:20.882 EST] [CommonAttributes.replaceVariables:1402] cdb1 var2

    [main] [2015-11-11 04:04:20.882 EST] [CommonAttributes.replaceVariables:1402] var2/u01/app/oracle

    [main] [2015-11-11 04:04:20.882 EST] [CommonAttributes.replaceVariables:1402] cdb1 var2

    [main] [2015-11-11 04:04:20.882 EST] [Host.getAuditNextGen:9054] / U01/app/oracle/audit audit of NextGen

    [main] [2015-11-11 04:04:20.883 EST] [CommonAttributes.replaceVariables:1402] var2/u01/app/oracle

    [main] [2015-11-11 04:04:20.883 EST] [CommonAttributes.replaceVariables:1402] var2/u01/app/oracle

    [main] [2015-11-11 04:04:20.883 EST] [Host.getFolders:10740] add path to DB_RECOVERY_FILE_DETS/u01/app/oracle/fast_recovery_area

    [main] [2015-11-11 04:04:20.883 EST] [Host.getFolders:10750]  RedoLogDestName db_create_online_log_dest_1

    [main] [2015-11-11 04:04:20.883 EST] [Host.getFolders:10750]  RedoLogDestName db_create_online_log_dest_2

    [main] [2015-11-11 04:04:20.883 EST] [Host.getFolders:10750]  RedoLogDestName db_create_online_log_dest_3

    [main] [2015-11-11 04:04:20.884 EST] [Host.getFolders:10750]  RedoLogDestName db_create_online_log_dest_4

    [main] [2015-11-11 04:04:20.884 EST] [Host.getFolders:10750]  RedoLogDestName db_create_online_log_dest_5

    [main] [2015-11-11 04:04:20.884 EST] [CommonAttributes.replaceVariables:1402] /u01/app/oracle/product/12.1.0.2/db_1 var2

    [main] [2015-11-11 04:04:20.884 EST] [CommonAttributes.replaceVariables:1402] cdb1 var2

    [main] [2015-11-11 04:04:20.884 EST] [CommonAttributes.replaceVariables:1402] /u01/app/oracle/product/12.1.0.2/db_1 var2

    [main] [2015-11-11 04:04:20.884 EST] [CommonAttributes.replaceVariables:1402] cdb1 var2

    [main] [2015-11-11 04:04:20.884 EST] [Host.getFolders:10786] add path to /u01/app/oracle/product/12.1.0.2/db_1/dbs

    [main] [2015-11-11 04:04:20.885 EST] [CommonAttributes.replaceVariables:1402] var2/u01/app/oracle

    [main] [2015-11-11 04:04:20.885 EST] [CommonAttributes.replaceVariables:1402] cdb1 var2

    [main] [2015-11-11 04:04:20.885 EST] [Host.getFolders:10838] add path/u01/app/oracle/oradata/cdb1

    [main] [2015-11-11 04:04:20.885 EST] [Host.getFolders:10841] m_enableDBConsolidation: true

    [main] [2015-11-11 04:04:20.885 EST] [InitParamAttributes.needPdbSeedConvert:5220]  OMF Mode: false usePdbFileNameConvert: false

    [main] [2015-11-11 04:04:20.886 EST] [Host.getFolders:10849] add path/u01/app/oracle/oradata/cdb1/pdbseed

    [main] [2015-11-11 04:04:20.886 EST] [CommonAttributes.replaceVariables:1402] var2/u01/app/oracle

    [main] [2015-11-11 04:04:20.886 EST] [CommonAttributes.replaceVariables:1402] cdb1 var2

    [main] [2015-11-11 04:04:20.886 EST] [Host.getFolders:10841] m_enableDBConsolidation: true

    [main] [2015-11-11 04:04:20.886 EST] [InitParamAttributes.needPdbSeedConvert:5220]  OMF Mode: false usePdbFileNameConvert: false

    [main] [2015-11-11 04:04:20.886 EST] [CommonAttributes.replaceVariables:1402] var2/u01/app/oracle

    [main] [2015-11-11 04:04:20.886 EST] [CommonAttributes.replaceVariables:1402] cdb1 var2

    [main] [2015-11-11 04:04:20.887 EST] [Host.getFolders:10841] m_enableDBConsolidation: true

    [main] [2015-11-11 04:04:20.887 EST] [InitParamAttributes.needPdbSeedConvert:5220]  OMF Mode: false usePdbFileNameConvert: false

    [main] [2015-11-11 04:04:20.887 EST] [CommonAttributes.replaceVariables:1402] var2/u01/app/oracle

    [main] [2015-11-11 04:04:20.887 EST] [CommonAttributes.replaceVariables:1402] cdb1 var2

    [main] [2015-11-11 04:04:20.887 EST] [CommonAttributes.replaceVariables:1402] var2/u01/app/oracle

    [main] [2015-11-11 04:04:20.887 EST] [CommonAttributes.replaceVariables:1402] cdb1 var2

    [main] [2015-11-11 04:04:20.887 EST] [CommonAttributes.replaceVariables:1402] var2/u01/app/oracle

    [main] [2015-11-11 04:04:20.888 EST] [CommonAttributes.replaceVariables:1402] cdb1 var2

    [main] [2015-11-11 04:04:20.888 EST] [CommonAttributes.replaceVariables:1402] var2/u01/app/oracle

    [main] [2015-11-11 04:04:20.888 EST] [CommonAttributes.replaceVariables:1402] cdb1 var2

    [main] [2015-11-11 04:04:20.888 EST] [CommonAttributes.replaceVariables:1402] var2/u01/app/oracle

    [main] [2015-11-11 04:04:20.888 EST] [CommonAttributes.replaceVariables:1402] cdb1 var2

    [main] [2015-11-11 04:04:20.888 EST] [CommonAttributes.replaceVariables:1402] var2/u01/app/oracle

    [main] [2015-11-11 04:04:20.888 EST] [CommonAttributes.replaceVariables:1402] cdb1 var2

    [main] [2015-11-11 04:04:20.889 EST] [CommonAttributes.replaceVariables:1402] var2/u01/app/oracle

    [main] [2015-11-11 04:04:20.889 EST] [CommonAttributes.replaceVariables:1402] cdb1 var2

    [main] [2015-11-11 04:04:20.892 EST] [Host.setUpForOperation:4253]  File [0] = / u01/app/oracle

    [main] [2015-11-11 04:04:20.892 EST] [Host.setUpForOperation:4253]  [1] file = / u01/app/oracle/admin/cdb1/adump

    [main] [2015-11-11 04:04:20.892 EST] [Host.setUpForOperation:4253]  Folder [2] = / u01/app/oracle/admin/cdb1/dpdump

    [main] [2015-11-11 04:04:20.892 EST] [Host.setUpForOperation:4253]  [3] file = / u01/app/oracle/admin/cdb1/pfile

    [main] [2015-11-11 04:04:20.892 EST] [Host.setUpForOperation:4253]  [4] file = / u01/app/oracle/audit

    [main] [2015-11-11 04:04:20.893 EST] [Host.setUpForOperation:4253]  [5] file = / u01/app/oracle/cfgtoollogs/dbca/cdb1

    [main] [2015-11-11 04:04:20.893 EST] [Host.setUpForOperation:4253]  [6] file = / u01/app/oracle/fast_recovery_area

    [main] [2015-11-11 04:04:20.893 EST] [Host.setUpForOperation:4253]  [7] folder = / u01/app/oracle/fast_recovery_area/cdb1

    [main] [2015-11-11 04:04:20.893 EST] [Host.setUpForOperation:4253]  [8] file = / u01/app/oracle/oradata/cdb1

    [main] [2015-11-11 04:04:20.893 EST] [Host.setUpForOperation:4253]  [9] file = / u01/app/oracle/oradata/cdb1/pdbseed

    [main] [2015-11-11 04:04:20.893 EST] [Host.setUpForOperation:4253]  Folder[10]=/U01/app/Oracle/product/12.1.0.2/Db_1/DBS

    [main] [2015-11-11 04:04:20.893 EST] [Host.executeSteps:6091] setupForOperation returned: true

    [main] [2015-11-11 04:04:20.894 EST] [Host.createStepSQLInterface:8605] sid = cdb1

    [main] [2015-11-11 04:04:20.894 EST] Cdb1 sidOrConnectString [Host.createStepSQLInterface:8606]

    [main] [2015-11-11 04:04:20.894 EST] [OracleHome.getVersion:991]  Called OracleHome.getVersion.  Current version: null

    [main] [2015-11-11 04:04:20.895 EST] Setting [InventoryUtil.getOUIInvSession:349] YES READ at ACCESSLEVEL_READ_LOCKLESS

    [main] [2015-11-11 04:04:20.896 EST] [OracleHome.getVersion:1010]  HomeInfo /u01/app/oracle/product/12.1.0.2/db_1,1

    [main] [2015-11-11 04:04:21.043 EST] [OracleHome.getVersion:1038]  OracleHome.server.getVersion Version: 12.1.0.2.0

    [main] [2015-11-11 04:04:21.043 EST] [OracleHome.getVersion:1059]  The current Version of the inventory: 12.1.0.2.0

    [main] [2015-11-11 04:04:21.043 EST] [OracleHome.getVersion:991]  Called OracleHome.getVersion.  Current version: 12.1.0.2.0

    [main] [2015-11-11 04:04:21.043 EST] [OracleHome.getVersion:1059]  The current Version of the inventory: 12.1.0.2.0

    [main] [2015-11-11 04:04:21.044 EST] [OracleHome.getVersion:991]  Called OracleHome.getVersion.  Current version: 12.1.0.2.0

    [main] [2015-11-11 04:04:21.044 EST] [OracleHome.getVersion:1059]  The current Version of the inventory: 12.1.0.2.0

    [main] [2015-11-11 04:04:21.044 EST] [SQLPlusEngine.getCmmdParams:225] m_home 12.1.0.2.0

    [main] [2015-11-11 04:04:21.044 EST] True for 112 > version [SQLPlusEngine.getCmmdParams:226]

    [main] [2015-11-11 04:04:21.044 EST] [SQLEngine.getEnvParams:602]  By default the NLS_LANG: AMERICAN_AMERICA. AL32UTF8

    [main] [2015-11-11 04:04:21.044 EST] [SQLEngine.getEnvParams:612]  NLS_LANG: AMERICAN_AMERICA. AL32UTF8

    [main] [2015-11-11 04:04:21.045 EST] [SQLEngine.initialize:358]  SQLPLUS/OPEN process execing...

    [main] [2015-11-11 04:04:21.056 EST] M_bReaderStarted [SQLEngine.initialize:395]: false

    [main] [2015-11-11 04:04:21.056 EST] [SQLEngine.initialize:399]  From the wire drive...

    [Thread-18] [2015-11-11 04:04:21.060 EST] Setting [InventoryUtil.getOUIInvSession:349] YES READ at ACCESSLEVEL_READ_LOCKLESS

    [Thread-18] [2015-11-11 04:04:21.060 EST] [InventoryUtil.getHomeName:113] homeName = OraDB12Home1

    [Thread-18] [2015-11-11 04:04:21.061 EST] [StepManager.getSteps:275] record defined folder: / u01/app/oracle/cfgtoollogs/dbca/cdb1

    [Thread-18] [2015-11-11 04:04:21.062 EST] [StepManager.getSteps:295] ckFileName /u01/app/oracle/cfgtoollogs/dbca/cdb1/OraDB12Home1_cdb1_creation_checkpoint.xml ckContext [email protected]

    [Thread-18] [2015-11-11 04:04:21.081 EST] FailedChkFiles [CheckpointContext.isCleanupNeeded:140] {/ u01/app/oracle/cfgtoollogs/dbca/cdb1/OraDB12Home1_cdb1_creation_checkpoint.xml=null}

    [Thread-18] [2015-11-11 04:04:21.081 EST] [CheckpointContext.isCleanupNeeded:149]  Could not verify the files [email protected] iterator

    [Thread-18] [2015-11-11 04:04:21.081 EST] [CheckpointContext.isCleanupNeeded:155] failed chjeckpoint file /u01/app/oracle/cfgtoollogs/dbca/cdb1/OraDB12Home1_cdb1_creation_checkpoint.xml

    [Thread-18] [2015-11-11 04:04:21.081 EST] [CheckpointContext.isCleanupNeeded:160] get all the list of control point

    [Thread-18] [2015-11-11 04:04:21.082 EST] [CheckpointContext.getAllCheckPoints:224] get all the list of control point

    [Thread-18] [2015-11-11 04:04:21.082 EST] [CheckpointContext.getAllCheckPoints:226] return all list of control point

    [Thread-18] [2015-11-11 04:04:21.082 EST] [CheckpointContext.isCleanupNeeded:163] all the checkpoint size 1 list

    [Thread-18] [2015-11-11 04:04:21.082 EST] [CheckpointContext.isCleanupNeeded:189] adding cleanup step because this is a retry operation.

    [Thread-18] [2015-11-11 04:04:21.082 EST] Old file deleted [CheckpointContext.isCleanupNeeded:196] control point: true

    [Thread-18] [2015-11-11 04:04:21.083 EST] [CheckpointContext.retrieveCheckPoint:338] check point db_cdb1 is from the [email protected] file

    [Thread-18] [2015-11-11 04:04:21.083 EST] [CommandLineArguments.getCmdLineWithoutPasswords:7686] Remove password for exploitation forest-SYSPASSWORD

    [Thread-18] [2015-11-11 04:04:21.083 EST] [CommandLineArguments.getCmdLineWithoutPasswords:7686] Remove password for exploitation forest-SYSTEMPASSWORD

    [Thread-18] [2015-11-11 04:04:21.084 EST] [CommandLineArguments.getCmdLineWithoutPasswords:7686] Remove password for exploitation forest-PDBADMINPASSWORD

    [Thread-18] [2015-11-11 04:04:21.084 EST] Checkpoint [StepManager.getSteps:326] [email protected] file

    [Thread-18] [2015-11-11 04:04:21.084 EST] [StepManager.getSteps:332] adding point of session control

    [Thread-18] [2015-11-11 04:04:21.084 EST] [StepManager.getSteps:334] recorded the new session of control point for the creation of the DB

    [Thread-18] [2015-11-11 04:04:21.084 EST] [StepManager.getSteps:430]  StepManager isHARegistrationRequired: false

    [Thread-18] [2015-11-11 04:04:21.101 EST] [StepContext$ ModeRunner.run:2873]-progress necessary: = true

    [Thread-18] [2015-11-11 04:04:21.101 EST] [BasicStep.execute:250]  Execution stage: CLEANING

    [Thread-18] [2015-11-11 04:04:21.102 EST] [BasicStep.configureSettings:353] updated messageHandler = null

    [Thread-18] [2015-11-11 04:04:21.103 EST] Setting [InventoryUtil.getOUIInvSession:349] YES READ at ACCESSLEVEL_READ_LOCKLESS

    [Thread-18] [2015-11-11 04:04:21.103 EST] [InventoryUtil.getHomeName:113] homeName = OraDB12Home1

    [Thread-18] [2015-11-11 04:04:21.103 EST] [BasicStep.configureSettings:353] messageHandler being [email protected]

    [Thread-18] [2015-11-11 04:04:21.104 EST] [StepContext$ ModeRunner.run:2873]-progress necessary: = true

    [Thread-18] [2015-11-11 04:04:21.104 EST] [BasicStep.execute:250]  Execution stage: CLONE_DB_CREATION_RMAN_RESTORE

    [Thread-18] [2015-11-11 04:04:21.126 EST] Parameter [StepErrorHandler.setFatalErrors:323] Fatal Error: ORA-01092

    [Thread-18] [2015-11-11 04:04:21.126 EST] Parameter [StepErrorHandler.setFatalErrors:323] Fatal Error: ORA-01034

    [Thread-18] [2015-11-11 04:04:21.126 EST] Parameter [StepErrorHandler.setFatalErrors:323] Fatal Error: ORA-03114

    [Thread-18] [2015-11-11 04:04:21.127 EST] Parameter [StepErrorHandler.setFatalErrors:323] Fatal Error: ORA-12560

    [Thread-18] [2015-11-11 04:04:21.127 EST] Parameter [StepErrorHandler.setIgnorableErrors:251] error can be ignored: ORA-01109

    [Thread-18] [2015-11-11 04:04:21.127 EST] [BasicStep.configureSettings:353] updated messageHandler = null

    [Thread-18] [2015-11-11 04:04:21.127 EST] [Host.getRMANConnectionInfo:1171]  To connect to the cdb1 Instance

    [Thread-18] [2015-11-11 04:04:21.129 EST] [BasicStep.execute:250]  Execution stage: INSTANCE_CREATION

    [Thread-18] [2015-11-11 04:04:21.129 EST] [BasicStep.configureSettings:353] updated messageHandler = null

    [Thread-18] [2015-11-11 04:04:21.129 EST] [InitParamAttributes.setPluggableDatabase:5115] setPluggableDatabase: bInclude = true

    [Thread-18] [2015-11-11 04:04:21.131 EST] [CommonAttributes.replaceVariables:1402] var2/u01/app/oracle

    [Thread-18] [2015-11-11 04:04:21.131 EST] [CommonAttributes.replaceVariables:1402] cdb1 var2

    [Thread-18] [2015-11-11 04:04:21.132 EST] [InitParamAttributes.sortParams:3916] m_sortOn: sortOn:4 - 1

    [Thread-18] [2015-11-11 04:04:21.154 EST] [InitParamAttributes.createInitFile:1811]  Init param db_block_size treatment

    [Thread-18] [2015-11-11 04:04:21.154 EST] [InitParamAttributes.createInitFile:1816]  The value is 8192

    [Thread-18] [2015-11-11 04:04:21.154 EST] [InitParamAttributes.createInitFile:1811]  Treatment open_cursors init param

    [Thread-18] [2015-11-11 04:04:21.155 EST] [InitParamAttributes.createInitFile:1816]  The value is 300

    [Thread-18] [2015-11-11 04:04:21.155 EST] [InitParamAttributes.createInitFile:1811]  Db_domain init param treatment

    [Thread-18] [2015-11-11 04:04:21.155 EST] [InitParamAttributes.createInitFile:1816]  The value is «»

    [Thread-18] [2015-11-11 04:04:21.155 EST] [InitParamAttributes.createInitFile:1811]  Treatment init param db_name

    [Thread-18] [2015-11-11 04:04:21.155 EST] [InitParamAttributes.createInitFile:1816]  The value is "cdb1".

    [Thread-18] [2015-11-11 04:04:21.155 EST] [InitParamAttributes.createInitFile:1811]  Control_files treatment init param

    [Thread-18] [2015-11-11 04:04:21.155 EST] [CommonAttributes.replaceVariables:1402] var2/u01/app/oracle

    [Thread-18] [2015-11-11 04:04:21.156 EST] [CommonAttributes.replaceVariables:1402] cdb1 var2

    [Thread-18] [2015-11-11 04:04:21.156 EST] [CommonAttributes.replaceVariables:1402] var2/u01/app/oracle

    [Thread-18] [2015-11-11 04:04:21.156 EST] [CommonAttributes.replaceVariables:1402] cdb1 var2

    [Thread-18] [2015-11-11 04:04:21.156 EST] [InitParamAttributes.createInitFile:1816]  The value is ("" / u01/app/oracle/oradata/cdb1/control01.ctl "," / u01/app/oracle/fast_recovery_area/cdb1/control02.ctl "")

    [Thread-18] [2015-11-11 04:04:21.156 EST] [InitParamAttributes.createInitFile:1811]  Treatment db_recovery_file_dest init param

    [Thread-18] [2015-11-11 04:04:21.156 EST] [CommonAttributes.replaceVariables:1402] var2/u01/app/oracle

    [Thread-18] [2015-11-11 04:04:21.157 EST] [InitParamAttributes.createInitFile:1816]  The value is ' / u01/app/oracle/fast_recovery_area.

    [Thread-18] [2015-11-11 04:04:21.157 EST] [InitParamAttributes.createInitFile:1811]  Treatment db_recovery_file_dest_size init param

    [Thread-18] [2015-11-11 04:04:21.157 EST] [InitParamAttributes.createInitFile:1816]  The value is 4560 m

    [Thread-18] [2015-11-11 04:04:21.157 EST] [InitParamAttributes.createInitFile:1811]  Compatible init param treatment

    [Thread-18] [2015-11-11 04:04:21.157 EST] [InitParamAttributes.createInitFile:1816]  The value is 12.1.0.2.0

    [Thread-18] [2015-11-11 04:04:21.157 EST] [InitParamAttributes.createInitFile:1811]  Treatment diagnostic_dest init param

    [Thread-18] [2015-11-11 04:04:21.157 EST] [CommonAttributes.replaceVariables:1402] var2/u01/app/oracle

    [Thread-18] [2015-11-11 04:04:21.158 EST] [InitParamAttributes.createInitFile:1816]  The value is/u01/app/oracle

    [Thread-18] [2015-11-11 04:04:21.158 EST] [InitParamAttributes.createInitFile:1811]  Treatment enable_pluggable_database init param

    [Thread-18] [2015-11-11 04:04:21.158 EST] [InitParamAttributes.createInitFile:1816]  The value is true

    [Thread-18] [2015-11-11 04:04:21.158 EST] [InitParamAttributes.createInitFile:1811]  Treatment memory_target init param

    [Thread-18] [2015-11-11 04:04:21.158 EST] [InitParamAttributes.createInitFile:1816]  The value is 396 m

    [Thread-18] [2015-11-11 04:04:21.158 EST] [InitParamAttributes.createInitFile:1811]  Treatment of the process init param

    [Thread-18] [2015-11-11 04:04:21.158 EST] [InitParamAttributes.createInitFile:1816]  The value is 300

    [Thread-18] [2015-11-11 04:04:21.159 EST] [InitParamAttributes.createInitFile:1811]  Treatment audit_file_dest init param

    [Thread-18] [2015-11-11 04:04:21.159 EST] [CommonAttributes.replaceVariables:1402] var2/u01/app/oracle

    [Thread-18] [2015-11-11 04:04:21.159 EST] [CommonAttributes.replaceVariables:1402] cdb1 var2

    [Thread-18] [2015-11-11 04:04:21.159 EST] [InitParamAttributes.createInitFile:1816]  The value is ' / u01/app/oracle/admin/cdb1/adump.

    [Thread-18] [2015-11-11 04:04:21.159 EST] [InitParamAttributes.createInitFile:1811]  Audit_trail init param treatment

    [Thread-18] [2015-11-11 04:04:21.159 EST] [InitParamAttributes.createInitFile:1816]  The value is db

    [Thread-18] [2015-11-11 04:04:21.159 EST] [InitParamAttributes.createInitFile:1811]  Treatment remote_login_passwordfile init param

    [Thread-18] [2015-11-11 04:04:21.160 EST] [InitParamAttributes.createInitFile:1816]  The value is EXCLUSIVE

    [Thread-18] [2015-11-11 04:04:21.160 EST] [InitParamAttributes.createInitFile:1811]  Treatment of init param dispatchers

    [Thread-18] [2015-11-11 04:04:21.160 EST] [CommonAttributes.replaceVariables:1402] cdb1 var2

    [Thread-18] [2015-11-11 04:04:21.160 EST] [InitParamAttributes.createInitFile:1816]  The value is "(PROTOCOL=TCP) (SERVICE = cdb1XDB)" "

    [Thread-18] [2015-11-11 04:04:21.160 EST] [InitParamAttributes.createInitFile:1811]  Treatment undo_tablespace init param

    [Thread-18] [2015-11-11 04:04:21.160 EST] [InitParamAttributes.createInitFile:1816]  The value is UNDOTBS1

    [Thread-18] [2015-11-11 04:04:21.162 EST] [HADatabaseUtils.isGridMgmtDB:2842]  Mgmt DBName srvm _mgmtdb

    [Thread-18] [2015-11-11 04:04:21.162 EST] [InstanceStep.executeImpl:280]  Check the registry with HA listener

    [Thread-18] [2015-11-11 04:04:21.162 EST] [Host.noEntryinOratab:7194]  Check for oratab arg passed...

    [Thread-18] [2015-11-11 04:04:21.163 EST] [Oratab.getTempFile:805]  Oratab Temp: / tmp/oratab

    [Thread-18] [2015-11-11 04:04:21.180 EST] [InstanceStep.executeImpl:331]  Location of the password before parsing /u01/app/oracle/product/12.1.0.2/db_1/dbs/orapwcdb1 file

    [Thread-18] [2015-11-11 04:04:21.180 EST] [InstanceStep.executeImpl:333]  Location of the password before parsing /u01/app/oracle/product/12.1.0.2/db_1/dbs/orapwcdb1 file

    [Thread-18] [2015-11-11 04:04:21.181 EST] [OracleHome.getVersion:991]  Called OracleHome.getVersion.  Current version: 12.1.0.2.0

    [Thread-18] [2015-11-11 04:04:21.181 EST] [OracleHome.getVersion:1059]  The current Version of the inventory: 12.1.0.2.0

    [Thread-18] [2015-11-11 04:04:21.181 EST] [OracleHome.getVersion:991]  Called OracleHome.getVersion.  Current version: 12.1.0.2.0

    [Thread-18] [2015-11-11 04:04:21.181 EST] [OracleHome.getVersion:1059]  The current Version of the inventory: 12.1.0.2.0

    [Thread-18] [2015-11-11 04:04:21.181 EST] [CommonUtils.createPasswordFile:1243] orapwd new appeal for 11.1 or above

    [Thread-18] [2015-11-11 04:04:21.181 EST] [OracleHome.getVersion:991]  Called OracleHome.getVersion.  Current version: 12.1.0.2.0

    [Thread-18] [2015-11-11 04:04:21.182 EST] [OracleHome.getVersion:1059]  The current Version of the inventory: 12.1.0.2.0

    [Thread-18] [2015-11-11 04:04:21.182 EST] [OracleHome.getVersion:991]  Called OracleHome.getVersion.  Current version: 12.1.0.2.0

    [Thread-18] [2015-11-11 04:04:21.182 EST] [OracleHome.getVersion:1059]  The current Version of the inventory: 12.1.0.2.0

    [Thread-18] [2015-11-11 04:04:21.182 EST] [CommonUtils.getPasswordFileCreateCmd:1182] for new orapwd to 11.1 or above

    [Thread-18] [2015-11-11 04:04:21.184 EST] [OracleHome.getVersion:991]  Called OracleHome.getVersion.  Current version: 12.1.0.2.0

    [Thread-18] [2015-11-11 04:04:21.184 EST] [OracleHome.getVersion:1059]  The current Version of the inventory: 12.1.0.2.0

    [Thread-18] [2015-11-11 04:04:21.184 EST] [OracleHome.getVersion:991]  Called OracleHome.getVersion.  Current version: 12.1.0.2.0

    [Thread-18] [2015-11-11 04:04:21.184 EST] [OracleHome.getVersion:1059]  The current Version of the inventory: 12.1.0.2.0

    [Thread-18] [2015-11-11 04:04:21.184 EST] /U01/app/oracle/product/12.1.0.2/db_1/bin/orapwd [CommonUtils.getPasswordFileCreateCmd:1213]

    [Thread-18] [2015-11-11 04:04:21.185 EST] File=/U01/app/Oracle/product/12.1.0.2/Db_1/DBS/orapwcdb1 [CommonUtils.getPasswordFileCreateCmd:1213]

    [Thread-18] [2015-11-11 04:04:21.185 EST] Force [CommonUtils.getPasswordFileCreateCmd:1213] = y

    [Thread-18] [2015-11-11 04:04:21.185 EST] [CommonUtils.getPasswordFileCreateCmd:1213] format = 12

    [Thread-18] [2015-11-11 04:04:21.185 EST] [OsUtilsBase.execProg:2123] start execProg with the input array.

    [Thread-18] [2015-11-11 04:04:21.229 EST] [OsUtilsBase.execProg:2160] done execProg with the input array. Status: 0

    [Thread-18] [2015-11-11 04:04:21.229 EST] [InstanceStep.setASMAdminGID:373] is: wrong Type of storage: 0

    [Thread-18] [2015-11-11 04:04:21.229 EST] [BasicStep.configureSettings:353] messageHandler being [email protected]

    [Thread-18] [2015-11-11 04:04:21.229 EST] [CloneRmanRestoreStep.executeImpl:270]  The Forum went well...

    [Thread-18] [2015-11-11 04:04:21.230 EST] [CloneRmanRestoreStep.executeImpl:277] db_recovery_file_dest = ' / u01/app/oracle/fast_recovery_area.

    [Thread-18] [2015-11-11 04:04:21.230 EST] [CloneRmanRestoreStep.executeImpl:280] db_recovery_file_dest_size = 4560 m

    [Thread-18] [2015-11-11 04:04:21.230 EST] [InitParameterFile.getLongValue:687]  Perhaps the unit. Stripping device and try with 4560

    [Thread-18] [2015-11-11 04:04:21.230 EST] [CloneRmanRestoreStep.executeImpl:297]  Setting NLS_LANG to AMERICA. AL32UTF8

    [Thread-18] [2015-11-11 04:04:21.230 EST] [SQLEngine.done:2278]  Called

    [Thread-18] [2015-11-11 04:04:21.232 EST] [SQLEngine.reInitialize:785]  The SQLEngine reset...

    [Thread-18] [2015-11-11 04:04:21.232 EST] [OracleHome.getVersion:991]  Called OracleHome.getVersion.  Current version: 12.1.0.2.0

    [Thread-18] [2015-11-11 04:04:21.232 EST] [OracleHome.getVersion:1059]  The current Version of the inventory: 12.1.0.2.0

    [Thread-18] [2015-11-11 04:04:21.232 EST] [OracleHome.getVersion:991]  Called OracleHome.getVersion.  Current version: 12.1.0.2.0

    [Thread-18] [2015-11-11 04:04:21.232 EST] [OracleHome.getVersion:1059]  The current Version of the inventory: 12.1.0.2.0

    [Thread-18] [2015-11-11 04:04:21.233 EST] [OracleHome.getVersion:991]  Called OracleHome.getVersion.  Current version: 12.1.0.2.0

    [Thread-18] [2015-11-11 04:04:21.233 EST] [OracleHome.getVersion:1059]  The current Version of the inventory: 12.1.0.2.0

    [Thread-18] [2015-11-11 04:04:21.233 EST] [SQLPlusEngine.getCmmdParams:225] m_home 12.1.0.2.0

    [Thread-18] [2015-11-11 04:04:21.233 EST] True for 112 > version [SQLPlusEngine.getCmmdParams:226]

    [Thread-18] [2015-11-11 04:04:21.233 EST] [SQLEngine.getEnvParams:612]  NLS_LANG: AMERICAN_AMERICA. AL32UTF8

    [Thread-18] [2015-11-11 04:04:21.234 EST] [SQLEngine.initialize:358]  SQLPLUS/OPEN process execing...

    [Thread-18] [2015-11-11 04:04:21.243 EST] M_bReaderStarted [SQLEngine.initialize:395]: false

    [Thread-18] [2015-11-11 04:04:21.243 EST] [SQLEngine.initialize:399]  From the wire drive...

    [Thread-18] [2015-11-11 04:04:21.244 EST] [SQLEngine.initialize:448]  Waiting for m_bReaderStarted to be true

    [Thread-21] [2015-11-11 04:04:21.263 EST] [email protected]:messageHandler [BasicStep.handleNonIgnorableError:479]

    [Thread-21] [2015-11-11 04:04:21.263 EST] [BasicStep.handleNonIgnorableError:480]  ORA-12547: TNS: lost contact

    : msg

    [Thread-18] [2015-11-11 04:04:21.263 EST] [SQLEngine.setSpool:2056] old coil = null

    [Thread-18] [2015-11-11 04:04:21.264 EST] [SQLEngine.setSpool:2057]  Layout = /u01/app/oracle/cfgtoollogs/dbca/cdb1/CloneRmanRestore.log coil

    [Thread-18] [2015-11-11 04:04:21.264 EST] [SQLEngine.setSpool:2058]  Coil is editable? -> true

    [Thread-18] [2015-11-11 04:04:21.264 EST] [CloneRmanRestoreStep.executeImpl:323] _diag_hm_rc_enabled false

    [Thread-18] [2015-11-11 04:04:21.264 EST] [CommonAttributes.replaceVariables:1402] /u01/app/oracle/product/12.1.0.2/db_1 var2

    [Thread-18] [2015-11-11 04:04:21.264 EST] [CloneRmanRestoreStep.executeImpl:358]  The control file using: /u01/app/oracle/product/12.1.0.2/db_1/assistants/dbca/templates/Seed_Database.ctl. sourceDBName: seeddata

    [Thread-18] [2015-11-11 04:04:21.265 EST] [OsUtilsBase.copyFile:1505]  OsUtilsBase.copyFile:

    [Thread-18] [2015-11-11 04:04:21.286 EST] [OsUtilsBase.copyFile:1553] * write files to complete destination...

    [Thread-18] [2015-11-11 04:04:21.289 EST] [OsUtilsBase.copyFile:1588] * copy of the file status: = true

    [Thread-18] [2015-11-11 04:04:21.291 EST] Journal of db [CloneRmanRestoreStep.executeImpl:399] update file alerts

    [Thread-18] [2015-11-11 04:04:21.291 EST] [CloneRmanRestoreStep.executeImpl:402]  Deletion of entries from v$ datafile_copy

    [Thread-18] [2015-11-11 04:04:21.292 EST] [CloneRmanRestoreStep.executeImpl:404]  Delete all entries from backup

    [Thread-18] [2015-11-11 04:04:21.292 EST] [CommonAttributes.replaceVariables:1402] var2/u01/app/oracle

    [Thread-18] [2015-11-11 04:04:21.294 EST] [CloneRmanRestoreStep.executeImpl:457]  Get the data file ID card and the names for the restoration

    [Thread-18] [2015-11-11 04:04:21.294 EST] [CommonAttributes.replaceVariables:1402] var2/u01/app/oracle

    [Thread-18] [2015-11-11 04:04:21.294 EST] [CommonAttributes.replaceVariables:1402] cdb1 var2

    [Thread-18] [2015-11-11 04:04:21.294 EST] [CloneRmanRestoreStep.getDatafileIdNameMapping:591] newname for datafile /u01/app/oracle/oradata/cdb1/sysaux01.dbf

    [Thread-18] [2015-11-11 04:04:21.294 EST] [CommonAttributes.replaceVariables:1402] var2/u01/app/oracle

    [Thread-18] [2015-11-11 04:04:21.294 EST] [CommonAttributes.replaceVariables:1402] cdb1 var2

    [Thread-18] [2015-11-11 04:04:21.295 EST] [CloneRmanRestoreStep.getDatafileIdNameMapping:591] newname for datafile /u01/app/oracle/oradata/cdb1/system01.dbf

    [Thread-18] [2015-11-11 04:04:21.295 EST] [CommonAttributes.replaceVariables:1402] var2/u01/app/oracle

    [Thread-18] [2015-11-11 04:04:21.295 EST] [CommonAttributes.replaceVariables:1402] cdb1 var2

    [Thread-18] [2015-11-11 04:04:21.295 EST] [CloneRmanRestoreStep.getDatafileIdNameMapping:591] newname for datafile /u01/app/oracle/oradata/cdb1/undotbs01.dbf

    [Thread-18] [2015-11-11 04:04:21.295 EST] [CommonAttributes.replaceVariables:1402] var2/u01/app/oracle

    [Thread-18] [2015-11-11 04:04:21.295 EST] [CommonAttributes.replaceVariables:1402] cdb1 var2

    [Thread-18] [2015-11-11 04:04:21.295 EST] [CloneRmanRestoreStep.getDatafileIdNameMapping:591] newname for datafile /u01/app/oracle/oradata/cdb1/users01.dbf

    [Thread-18] [2015-11-11 04:04:21.298 EST] [RMANUtil.getRMANUtil:147] creating new instance util

    [Thread-18] [2015-11-11 04:04:21.298 EST] [RMANUtil.getRMANUtil:148] target sid cdb1

    [Thread-18] [2015-11-11 04:04:21.298 EST] [CommonAttributes.replaceVariables:1402] /u01/app/oracle/product/12.1.0.2/db_1 var2

    [Thread-18] [2015-11-11 04:04:21.301 EST] [RMANEngine.getCmmdParams:343] with /u01/app/oracle/product/12.1.0.2/db_1/bin/rman rman

    [Thread-18] [2015-11-11 04:04:21.301 EST] [RMANEngine.getEnvParams:436]  NLS_LANG: AMERICAN_AMERICA. AL32UTF8

    [Thread-18] [2015-11-11 04:04:21.302 EST] [RMANEngine.initialize:195]  RMAN execing to initialize process...

    [Thread-18] [2015-11-11 04:04:21.313 EST] [RMANEngine.initialize:221]  RMAN created initialization process...

    [Thread-18] [2015-11-11 04:04:21.313 EST] [RMANEngine.initialize:235]  From the wire drive...

    [Thread-18] [2015-11-11 04:04:21.324 EST] [RMANEngine.initialize:239]  Player started thread for RMAN initialization process...

    [Thread-18] [2015-11-11 04:04:21.348 EST] [RMANEngine.initialize:247]  Error starting thread for RMAN initialization process...

    [Thread-18] [2015-11-11 04:04:21.348 EST] [RMANEngine.initialize:252]  Output writer created for the RMAN of initialization process...

    [Thread-18] [2015-11-11 04:04:21.348 EST] [RMANEngine.initialize:290]  Created Log writer for RMAN to initialize process...

    [Thread-18] [2015-11-11 04:04:21.349 EST] [RMANEngine.initialize:295]  M_bReaderStarted to initialize value = false

    [Thread-18] [2015-11-11 04:04:21.349 EST] [RMANEngine.initialize:299]  Waiting for m_bReaderStarted to be true

    [Thread-24] [2015-11-11 04:04:21.349 EST] [RMANEngine.run:803]  Player started thread for RMAN initialization process...

    [Thread-24] [2015-11-11 04:04:21.349 EST] [RMANEngine.run:807]  M_bReaderStarted set to true to initialize...

    [Thread-18] [2015-11-11 04:04:21.360 EST] [RMANEngine.initialize:310]  Fact certain player started for the process of RMAN to initialize...

    [Thread-18] [2015-11-11 04:04:21.360 EST] [RMANEngine.connect:775]  Don't use DO NOT OS auth to connect

    [Thread-18] [2015-11-11 04:04:21.360 EST] [RMANEngine.executeImpl:1186] m_bExecQuery = false

    [Thread-18] [2015-11-11 04:04:21.360 EST] [RMANEngine.executeImpl:1194]  Command rman process writing = connection target SYS / *.

    [Thread-18] [2015-11-11 04:04:21.361 EST] [RMANEngine.executeImpl:1222]  Advise the reader to start reading

    [Thread-24] [2015-11-11 04:04:21.361 EST] [RMANEngine.readSqlOutput:889]  Log RMAN output =

    [Thread-24] [2015-11-11 04:04:21.361 EST] [RMANEngine.readSqlOutput:889]  Connect the output RMAN = Recovery Manager: release 12.1.0.2.0 - Production Wed Nov 11 04:04:21 2015

    [Thread-24] [2015-11-11 04:04:21.361 EST] [RMANEngine.readSqlOutput:889]  Log RMAN output =

    [Thread-24] [2015-11-11 04:04:21.362 EST] [RMANEngine.readSqlOutput:889]  Connect the output RMAN = Copyright (c) 1982, 2014, Oracle and/or its affiliates.  All rights reserved.

    [Thread-24] [2015-11-11 04:04:21.402 EST] [RMANEngine.readSqlOutput:889]  Log RMAN output =

    [Thread-24] [2015-11-11 04:04:21.406 EST] [RMANEngine.readSqlOutput:889]  Connect the output = RMAN RMAN >

    [Thread-24] [2015-11-11 04:04:21.413 EST] [RMANEngine.readSqlOutput:889]  Connect the RMAN RMAN-00571 = out: =.

    [Thread-24] [2015-11-11 04:04:21.413 EST] [RMANEngine.readSqlOutput:889]  Connect the RMAN RMAN-00569 = out: = ERROR MESSAGE STACK FOLLOWS =.

    [Thread-24] [2015-11-11 04:04:21.413 EST] [RMANEngine.readSqlOutput:889]  Connect the RMAN RMAN-00571 = out: =.

    [Thread-24] [2015-11-11 04:04:21.414 EST] [RMANEngine.readSqlOutput:889]  Connect the output RMAN = ORA-12547: TNS: lost contact

    [Thread-24] [2015-11-11 04:04:21.414 EST] [RMANEngine.readSqlOutput:889]  Log RMAN output =

    [Thread-24] [2015-11-11 04:04:21.414 EST] [RMANEngine.readSqlOutput:889]  Connect the output = RMAN RMAN >

    [Thread-24] [2015-11-11 04:04:21.414 EST] [RMANEngine.readSqlOutput:889]  Connect the RMAN = game of echo output on

    [Thread-24] [2015-11-11 04:04:21.414 EST] [RMANEngine.readSqlOutput:889]  Connect the RMAN set echo off = output;

    [Thread-24] [2015-11-11 04:04:21.414 EST] [RMANEngine.readSqlOutput:932] hasError is true

    [Thread-24] [2015-11-11 04:04:21.414 EST] [RMANEngine.readSqlOutput:938]  TRACK OF THE DETECTED ERROR

    [Thread-24] [2015-11-11 04:04:21.415 EST] [RMANEngine.readSqlOutput:945] m_errHdlr = null

    [Thread-24] [2015-11-11 04:04:21.415 EST] [RMANEngine.readSqlOutput:969]  DETECTED FATAL ERROR

    [Thread-24] [2015-11-11 04:04:21.415 EST] [RMANEngine.readSqlOutput:1033]  Writer notifying to proceed because m_bInterrupted = falsebNotify = truem_bReaderDone = truem_bFatalErrorOccured = true

    [Thread-24] [2015-11-11 04:04:21.415 EST] [RMANEngine.run:817]  Return value of readSqlOutput = null

    [Thread-18] [2015-11-11 04:04:21.415 EST] [RMANEngine.executeImpl:1234]  Filled with expectation of the reader

    [Thread-18] [2015-11-11 04:04:21.415 EST] [RMANEngine.executeImpl:1249]  Appeal is as had exception

    [Thread-18] [2015-11-11 04:04:21.415 EST] [RMANEngine.done:1554]  Called

    [Thread-18] [2015-11-11 04:04:21.416 EST] [RMANEngine.executeImpl:1276]  Received the FATAL error = Recovery Manager: release 12.1.0.2.0 - Production Wed Nov 11 04:04:21 2015

    Copyright (c) 1982, 2014, Oracle and/or its affiliates.  All rights reserved.

    RMAN >

    RMAN-00571: ===========================================================

    RMAN-00569: = ERROR MESSAGE STACK FOLLOWS =.

    RMAN-00571: ===========================================================

    ORA-12547: TNS: lost contact

    RMAN >

    echo on

    [Thread-18] [2015-11-11 04:04:21.416 EST] [RMANUtil.catalogBackup:487]  The cataloguing of backups RMAN error: could not get RMANUtil

    [Thread-18] [2015-11-11 04:04:21.416 EST] Exception [CloneRmanRestoreStep.executeImpl:491] rename files of data oracle.sysman.assistants.util.rmanEngine.RMANFatalErrorException: cataloguing of backups RMAN error

    [Thread-18] [2015-11-11 04:04:21.416 EST] [BasicStep.configureSettings:353] messageHandler being [email protected]

    [Thread-18] [2015-11-11 04:04:21.416 EST] [StepContext$ ModeRunner.run:2899]  The cataloguing of backups RMAN error

    oracle.sysman.assistants.dbca.backend.CloneRmanRestoreStep.executeImpl(CloneRmanRestoreStep.java:492)

    oracle.sysman.assistants.util.step.BasicStep.execute(BasicStep.java:259)

    oracle.sysman.assistants.util.step.Step.execute(Step.java:135)

    oracle.sysman.assistants.util.step.StepContext$ ModeRunner.run (StepContext.java:2883)

    java.lang.Thread.run(Thread.java:682)

    [Thread-18] [2015-11-11 04:04:21.417 EST] [SQLEngine.done:2278]  Called

    [Thread-18] [2015-11-11 04:04:21.417 EST] [SQLEngine.spoolOff:2124]  Setting off coil = /u01/app/oracle/cfgtoollogs/dbca/cdb1/CloneRmanRestore.log

    [Thread-18] [2015-11-11 04:04:21.418 EST] [Host.createStepSQLInterface:8605] sid = cdb1

    [Thread-18] [2015-11-11 04:04:21.418 EST] Cdb1 sidOrConnectString [Host.createStepSQLInterface:8606]

    [Thread-18] [2015-11-11 04:04:21.418 EST] [OracleHome.getVersion:991]  Called OracleHome.getVersion.  Current version: null

    [Thread-18] [2015-11-11 04:04:21.420 EST] Setting [InventoryUtil.getOUIInvSession:349] YES READ at ACCESSLEVEL_READ_LOCKLESS

    [Thread-18] [2015-11-11 04:04:21.420 EST] [OracleHome.getVersion:1010]  HomeInfo /u01/app/oracle/product/12.1.0.2/db_1,1

    [Thread-18] [2015-11-11 04:04:21.525 EST] [OracleHome.getVersion:1038]  OracleHome.server.getVersion Version: 12.1.0.2.0

    [Thread-18] [2015-11-11 04:04:21.525 EST] [OracleHome.getVersion:1059]  The current Version of the inventory: 12.1.0.2.0

    [Thread-18] [2015-11-11 04:04:21.525 EST] [OracleHome.getVersion:991]  Called OracleHome.getVersion.  Current version: 12.1.0.2.0

    [Thread-18] [2015-11-11 04:04:21.525 EST] [OracleHome.getVersion:1059]  The current Version of the inventory: 12.1.0.2.0

    [Thread-18] [2015-11-11 04:04:21.526 EST] [OracleHome.getVersion:991]  Called OracleHome.getVersion.  Current version: 12.1.0.2.0

    [Thread-18] [2015-11-11 04:04:21.526 EST] [OracleHome.getVersion:1059]  The current Version of the inventory: 12.1.0.2.0

    [Thread-18] [2015-11-11 04:04:21.526 EST] [SQLPlusEngine.getCmmdParams:225] m_home 12.1.0.2.0

    [Thread-18] [2015-11-11 04:04:21.526 EST] True for 112 > version [SQLPlusEngine.getCmmdParams:226]

    [Thread-18] [2015-11-11 04:04:21.526 EST] [SQLEngine.getEnvParams:612]  NLS_LANG: AMERICAN_AMERICA. AL32UTF8

    [Thread-18] [2015-11-11 04:04:21.527 EST] [SQLEngine.initialize:358]  SQLPLUS/OPEN process execing...

    [Thread-18] [2015-11-11 04:04:21.539 EST] M_bReaderStarted [SQLEngine.initialize:395]: false

    [Thread-18] [2015-11-11 04:04:21.539 EST] [SQLEngine.initialize:399]  From the wire drive...

    [Thread-18] [2015-11-11 04:04:21.541 EST] [CloneRmanRestoreStep.cancel:722]  Partially failed cleanup of the extracted files

    [Thread-18] [2015-11-11 04:04:21.549 EST] [SQLEngine.done:2278]  Called

    [Thread-18] [2015-11-11 04:04:21.549 EST] [CloneRmanRestoreStep.cancel:737]  RMAN Cleanup failed

    [Thread-18] [2015-11-11 04:04:21.549 EST] [CloneRmanRestoreStep.cancel:738]  ORA-12547: TNS: lost contact

    oracle.sysman.assistants.util.sqlEngine.SQLEngine.executeImpl(SQLEngine.java:1739)

    oracle.sysman.assistants.util.sqlEngine.SQLEngine.connect(SQLEngine.java:987)

    oracle.sysman.assistants.dbca.backend.CloneRmanRestoreStep.cancel(CloneRmanRestoreStep.java:725)

    oracle.sysman.assistants.util.step.StepContext$ ModeRunner.cancel (StepContext.java:2979)

    oracle.sysman.assistants.util.step.StepContext$ ModeRunner.run (StepContext.java:2940)

    java.lang.Thread.run(Thread.java:682)

    [Thread-18] [2015-11-11 04:04:21.550 EST] [CloneDBCreationStep.cancel:1178]  CloneDBCreationStep.cancel (): nodeList = null

    [Thread-18] [2015-11-11 04:04:21.550 EST] [SQLEngine.reInitialize:785]  The SQLEngine reset...

    [Thread-18] [2015-11-11 04:04:21.550 EST] [OracleHome.getVersion:991]  Called OracleHome.getVersion.  Current version: 12.1.0.2.0

    [Thread-18] [2015-11-11 04:04:21.550 EST] [OracleHome.getVersion:1059]  The current Version of the inventory: 12.1.0.2.0

    [Thread-18] [2015-11-11 04:04:21.550 EST] [OracleHome.getVersion:991]  Called OracleHome.getVersion.  Current version: 12.1.0.2.0

    [Thread-18] [2015-11-11 04:04:21.550 EST] [OracleHome.getVersion:1059]  The current Version of the inventory: 12.1.0.2.0

    [Thread-18] [2015-11-11 04:04:21.550 EST] [OracleHome.getVersion:991]  Called OracleHome.getVersion.  Current version: 12.1.0.2.0

    [Thread-18] [2015-11-11 04:04:21.551 EST] [OracleHome.getVersion:1059]  The current Version of the inventory: 12.1.0.2.0

    [Thread-18] [2015-11-11 04:04:21.551 EST] [SQLPlusEngine.getCmmdParams:225] m_home 12.1.0.2.0

    [Thread-18] [2015-11-11 04:04:21.551 EST] True for 112 > version [SQLPlusEngine.getCmmdParams:226]

    [Thread-18] [2015-11-11 04:04:21.551 EST] [SQLEngine.getEnvParams:612]  NLS_LANG: AMERICAN_AMERICA. AL32UTF8

    [Thread-18] [2015-11-11 04:04:21.551 EST] [SQLEngine.initialize:358]  SQLPLUS/OPEN process execing...

    [Thread-18] [2015-11-11 04:04:21.565 EST] M_bReaderStarted [SQLEngine.initialize:395]: false

    [Thread-18] [2015-11-11 04:04:21.565 EST] [SQLEngine.initialize:399]  From the wire drive...

    [Thread-18] [2015-11-11 04:04:21.566 EST] [SQLEngine.initialize:448]  Waiting for m_bReaderStarted to be true

    [Thread-18] [2015-11-11 04:04:21.585 EST] [SQLEngine.done:2278]  Called

    [Thread-18] [2015-11-11 04:04:21.585 EST] [Oratab.getTempFile:805]  Oratab Temp: / tmp/oratab

    [Thread-18] [2015-11-11 04:04:21.586 EST] [OsUtilsBase.deleteFile:1803]  OsUtilsBase.deleteFile: /u01/app/oracle/product/12.1.0.2/db_1/dbs/orapwcdb1

    [Thread-18] [2015-11-11 04:04:21.586 EST] [OsUtilsBase.deleteFile:1803]  OsUtilsBase.deleteFile: /u01/app/oracle/product/12.1.0.2/db_1/dbs/initcdb1.ora

    [Thread-18] [2015-11-11 04:04:21.586 EST] [OsUtilsBase.deleteFile:1803]  OsUtilsBase.deleteFile: /u01/app/oracle/admin/cdb1/pfile/init.ora

    [Thread-18] [2015-11-11 04:04:21.588 EST] [CloneDBCreationStep.cancel:1225]  CloneDBCreationStep.cancel (): Jaqueline = false

    [Thread-18] [2015-11-11 04:04:21.588 EST] [CommonAttributes.replaceVariables:1402] var2/u01/app/oracle

    [Thread-18] [2015-11-11 04:04:21.588 EST] [CommonAttributes.replaceVariables:1402] cdb1 var2

    [Thread-18] [2015-11-11 04:04:21.588 EST] [OsUtilsBase.deleteFile:1803]  OsUtilsBase.deleteFile: /u01/app/oracle/oradata/cdb1/sysaux01.dbf

    [Thread-18] [2015-11-11 04:04:21.588 EST] [CommonAttributes.replaceVariables:1402] var2/u01/app/oracle

    [Thread-18] [2015-11-11 04:04:21.589 EST] [CommonAttributes.replaceVariables:1402] cdb1 var2

    [Thread-18] [2015-11-11 04:04:21.589 EST] [OsUtilsBase.deleteFile:1803]  OsUtilsBase.deleteFile: /u01/app/oracle/oradata/cdb1/system01.dbf

    [Thread-18] [2015-11-11 04:04:21.589 EST] [CommonAttributes.replaceVariables:1402] var2/u01/app/oracle

    [Thread-18] [2015-11-11 04:04:21.589 EST] [CommonAttributes.replaceVariables:1402] cdb1 var2

    [Thread-18] [2015-11-11 04:04:21.589 EST] [OsUtilsBase.deleteFile:1803]  OsUtilsBase.deleteFile: /u01/app/oracle/oradata/cdb1/undotbs01.dbf

    [Thread-18] [2015-11-11 04:04:21.589 EST] [CommonAttributes.replaceVariables:1402] var2/u01/app/oracle

    [Thread-18] [2015-11-11 04:04:21.589 EST] [CommonAttributes.replaceVariables:1402] cdb1 var2

    [Thread-18] [2015-11-11 04:04:21.589 EST] [OsUtilsBase.deleteFile:1803]  OsUtilsBase.deleteFile: /u01/app/oracle/oradata/cdb1/users01.dbf

    [Thread-18] [2015-11-11 04:04:21.590 EST] [CommonAttributes.replaceVariables:1402] var2/u01/app/oracle

    [Thread-18] [2015-11-11 04:04:21.590 EST] [CommonAttributes.replaceVariables:1402] cdb1 var2

    [Thread-18] [2015-11-11 04:04:21.590 EST] [OsUtilsBase.deleteFile:1803]  OsUtilsBase.deleteFile: /u01/app/oracle/oradata/cdb1/redo01.log

    [Thread-18] [2015-11-11 04:04:21.590 EST] [CommonAttributes.replaceVariables:1402] var2/u01/app/oracle

    [Thread-18] [2015-11-11 04:04:21.590 EST] [CommonAttributes.replaceVariables:1402] cdb1 var2

    [Thread-18] [2015-11-11 04:04:21.590 EST] [OsUtilsBase.deleteFile:1803]  OsUtilsBase.deleteFile: /u01/app/oracle/oradata/cdb1/redo02.log

    [Thread-18] [2015-11-11 04:04:21.590 EST] [CommonAttributes.replaceVariables:1402] var2/u01/app/oracle

    [Thread-18] [2015-11-11 04:04:21.591 EST] [CommonAttributes.replaceVariables:1402] cdb1 var2

    [Thread-18] [2015-11-11 04:04:21.591 EST] [OsUtilsBase.deleteFile:1803]  OsUtilsBase.deleteFile: /u01/app/oracle/oradata/cdb1/redo03.log

    [Thread-18] [2015-11-11 04:04:21.591 EST] [CommonAttributes.replaceVariables:1402] var2/u01/app/oracle

    [Thread-18] [2015-11-11 04:04:21.591 EST] [CommonAttributes.replaceVariables:1402] cdb1 var2

    [Thread-18] [2015-11-11 04:04:21.591 EST] [OsUtilsBase.deleteFile:1803]  OsUtilsBase.deleteFile: /u01/app/oracle/oradata/cdb1/control01.ctl

    [Thread-18] [2015-11-11 04:04:21.591 EST] [CommonAttributes.replaceVariables:1402] var2/u01/app/oracle

    [Thread-18] [2015-11-11 04:04:21.591 EST] [CommonAttributes.replaceVariables:1402] cdb1 var2

    [Thread-18] [2015-11-11 04:04:21.592 EST] [OsUtilsBase.deleteFile:1803]  OsUtilsBase.deleteFile: /u01/app/oracle/fast_recovery_area/cdb1/control02.ctl

    [Thread-18] [2015-11-11 04:04:21.612 EST] [SQLEngine.done:2278]  Called

    [main] [2015-11-11 04:04:21.613 EST] [SQLEngine.done:2278]  Called

    [main] [2015-11-11 04:04:21.613 EST] [Host.cleanup:3928]  Exit DBCA status is: 1

    [main] [2015-11-11 04:04:21.613 EST] [Host.cleanup:3931] checkpoint context [email protected]

    [main] [2015-11-11 04:04:21.614 EST] Setting [InventoryUtil.getOUIInvSession:349] YES READ at ACCESSLEVEL_READ_LOCKLESS

    [main] [2015-11-11 04:04:21.615 EST] [InventoryUtil.getHomeName:113] homeName = OraDB12Home1

    [main] [2015-11-11 04:04:21.615 EST] [Host.cleanup:3957] check point [email protected]

    [main] [2015-11-11 04:04:21.639 EST] [OsUtilsBase.copyFile:1505]  OsUtilsBase.copyFile:

    [main] [2015-11-11 04:04:21.640 EST] [OsUtilsBase.copyFile:1553] * write files to complete destination...

    [main] [2015-11-11 04:04:21.640 EST] [OsUtilsBase.copyFile:1588] * copy of the file status: = true

    [main] [2015-11-11 04:04:21.640 EST] [OsUtilsBase.deleteFile:1803]  OsUtilsBase.deleteFile: /u01/app/oracle/cfgtoollogs/dbca/silent.log_2015-11-11_04-04-19-AM

    [Thread-3] [2015-11-11 04:04:21.644 EST] [DbcaCleanupHook.run:44]  Cleanup began

    [Thread-3] [2015-11-11 04:04:21.645 EST] [OracleHome.cleanupDBOptionsIntance:1671]  Dummy sid = null instance DB options

    [Thread-3] [2015-11-11 04:04:21.645 EST] [DbcaCleanupHook.run:49]  Cleanup

    Thanks for your tip, but in the meantime, I managed to create a database

    What I can say is that I have not touched the "/ etc/oracle/olr.loc" file. I completely uninstalled the software Oracle of this machine and started from the beginning again. It's the addidtional steps I did:

    1. I downloaded Xming to use the GUI Installation process (it helped me a lot, but I'm sure that this step is not necessary)

    Preliminary tests have shown something.  I did then:

    2. lack of space Swap--> so I created a swap file

    3 compat-libcap1 was absent. I tried to install it, but that has not worked.

    4. that's why I had to download the RPG - GPG - KEY Oracle, install it and remane RPM-GPG-KEY-oracle-ol7 to TR/MIN-GPG-KEY-oracle. Then I could install compat-libcap1

    5. the latest (and in my opinion the most important) step is to configure the file/etc/hosts. Firstly I had no entry for Oracle there (does not), then I used the private DNS provided by Amazon (also did not work) and then I used the private IP address, as shown in the AWS management console (which worked).

    After these steps, I was able to create a database.

  • Error code: 0xC800042D while trying to access the Windows Update Web site

    Original title: Windows Update error Access

    When you try to access the Windows update site to see what optional updates are available I got OxC800042D error message and can not access the site. Please tell us how to get around this problem. Thank you

    Hi AlanHy,
     
    These errors can occur caused by one of the following problems:
    • Applications or processes that interfere with Internet communications
    • Problems on your computer
    • Strong Internet activity
    • Recoverable database errors

    Follow the steps listed in this article to resolve the problem:

    You may encounter temporary connection related errors when you use Windows Update or Microsoft Update to install updates

  • error code 663 while trying to install the update for silverlight KB26990729

    Have tried several times to update the two Trend Mico but will not because of the absence of windows vista home premium updates and yet no update will load

    Hello

    Did you last modified the software on the computer?

    I suggest to disable anti-virus and try the steps mentioned below.

    NOTE: Antivirus software can help protect your computer against viruses and other security threats. In most cases, you should not disable your antivirus software. If you need to disable temporarily to install other software, you must reactivate as soon as you are finished. If you are connected to the Internet or a network, while your antivirus software is disabled, your computer is vulnerable to attacks.

    Then I suggest you go through the steps mentioned in the link and the Coachman. You can also run the FIXIT from the link below.

    Method 1:

    Problems with installing updates

    http://Windows.Microsoft.com/en-us/Windows-Vista/troubleshoot-problems-with-installing-updates

    If the steps do not help, then you can go to the method 2:

    Method 2:

    I also suggest you go through the steps mentioned in the link and the Coachman.

    You cannot install some programs or updates

    http://support.Microsoft.com/kb/822798

    Method 3:

    You can also try the FIXIT from the link below and check.

    How to manually clean a broken Silverlight installation

    http://blogs.msdn.com/b/rpomeroy/archive/2008/06/10/how-to-manually-clean-up-a-bad-Silverlight-installation.aspx

    If the issue does not help, then you can also post your query to:

    Welcome to the Silverlight.NET Forums

    http://forums.Silverlight.NET/

  • I get an error code 1402 while trying to install the update for adobe acrobat 9 standard.

    Try to install the latest update to acrobat 9 standard, I get the error message 1402. Adobe technical support tried to adjust my admin settings to allow the update, but got an another error message saying that access is denied to a particular folder Acrobat9/resource/CMAp. I tired changing setting of security/admin on this point, but no luck. Technical support Adobe that it is a question of authorization/administrator MS. help?

    Cannot install original title update: adobe acrobat 9 standard

    Hi basically,

    Method-

     

    Note: Important This section, method, or task contains steps that tell you how to modify the registry. However, serious problems can occur if you modify the registry incorrectly. Therefore, make sure that you proceed with caution. For added protection, back up the registry before you edit it. Then you can restore the registry if a problem occurs.

    Back up the registry - http://windows.microsoft.com/en-US/windows-vista/Back-up-the-registry

    Perform the steps in the article-

    Error 1402

     

    Note: The antivirus will try to repair the defective hard disk sectors damaged by viruses. Data on these areas could be lost in the process. Proceed at your own risk.

    Hope this helps!

     

  • Error install "0xc8000222" while trying to install the KB971138 fix

    Hello

    Recently, I tried to install Autodesk Inventor 2013. During this process, he lets know me he needs KB971138 patch to install correctly under Windows Vista. I got the patch downloaded and everything, but when I try to run the Setup program, a small box appears and says "Setup has encountered an error: 0xc8000222.

    I'm not sure what that means, or how it applies to Autodesk, but he won't let me use it. I already tried to contact Autodesk, and they have done nothing but redirect me to the page "download the fix.

    If anyone can help, that would be greatly appreciated. Also, if you need more information, ask here.

    Thank you

    Hello

    It seems that the problem is with the Setup program.

    I suggest you try the steps mentioned in the link.

    http://support.Microsoft.com/kb/2438651/

    Check if it helps.

  • Error code 800F081F while trying to install the update to windows security

    I have to install updates in order to renew my soft security on my laptop but whenever I try to install the updates to windows, I get an error code. It's 800F081F and I can't understand what this means or what I need to do to correct the problem. If anyone can help me, I would really appreciate it!

    Thank you!

    source CBS_E_SOURCE_MISSING 0x800f081F for unsuccessful package or file not found, ResolveSource()

    Clear your Temp File/Cache first upward.

    http://winhelp2002.MVPs.org/delcache.htm>

    Click Start > all programs > Accessories > System Tools > Disk Cleanup

    http://www.WinHelp.us/index.php/Windows/enhancing-Windows-performance/free-up-disk-space-in-Windows.html>

    Better and easier to use - CCleaner.

    Download the basic build (slim) via

    http://www.CCleaner.com/download/builds.aspx>

    The basic build (slim) does not contain the toolbar disgusted

    Cleaning DO NOT USE ANY Advanced options. TOUCH NOT THE REGISTRY. At least not for now.

    Reset

    Description of the preparation tool system update for Windows Vista for Windows Server 2008, for Windows 7 and for Windows Server 2008 R2

    http://support.Microsoft.com/kb/947821>

    If the system update tool does not resolve the problem, you will need repair Windows.

    UTC/GMT is 15:34 Wednesday, June 13, 2012

  • error code 11 while trying to open the .indd file

    Im having a small opening some .indd files problem, they worked very well when I tried to view them later in the week. When I double click on open today, I had a small box indicating "configuration error, uninstall and reinstall and it shows as a CODE of ERROR: 11 I already uninstalled and reinstalled indesign cc, but it still shows the error when you try to view the files. Any help on fixing this problem.

    What version of ID? OPERATING SYSTEM? You have trashed the prefs? See replace your preferences

Maybe you are looking for


HashFlare