macOS installation of Sierra (from El Capitan) fails with the message "internal error."

Tried the update to Mac OS Sierra and it seemed that everything was fine, but at the very end of the process, it would not be completed installation. Sierra downloaded OK and when I click on install it went through a process of 15 to 30 minutes, rebooted and then watched as he was finishing the installation for a few minutes. But then I got similar error message (a gray window clear on a gray screen dark, with a round Sierra icon upwards):

"Mac OS could not be installed on your computer.

An internal error has occurred.

Quit the installer to restart your computer and try again

[Button] »

I have a Macbook Pro retina mid 2012 with a processor clocked at 2.6 GHz Intel Core i7, NVIDIA GeForce GT 650 M 1024 MB graphics, 16 GB 1600 MHz DDR3 RAM and a SM768E of APPLE SSD flash hard drive. I ran disk utility, and it says everything is fine. I tried different approaches, several times, but no matter what I try, I can't seem to install the new macOS Sierra. I even wiped my entire computer and started from scratch, by installing a clean OS X 11 (El Capitan) and then try to install the Sierra, but still it does not work. This makes me think that maybe that's a problem with my App Store account? But given that I was connected, I'm not sure that it could be. Or maybe it's hardware related? I do not know. Even the SR Advisor. Apple I was talking with the phone was perplexed.

Super frustrated, certainly would like some advice, thanks!

Advertisement

https://support.Apple.com/en-us/HT201262

Try starting mode safe mode and see if you can install it then

Tags: Mac OS & System Software

Similar Questions

  • Uninstaller fails with the message < internal error - cannot find utCompiledCode record for this version of the uninstaller

    Computer = Sony Viao running Vista SP 2. Uninstaller for Windows seems to be corrupted when trying to uninstall 'Adobe Air' (which is reported at startup). Installer UN seems frozen in an unfinished task. Attempts to install a program displays ... Microsoft FixIt for problems installing could not solve it. What is a utCompiledCode? and the Setup program itself is re-installed/updated? You want to avoid the system restore because of recently resolved driver h/ware problems.

    Hey Johnwarrell,

    You can try using this free program. I don't know if it can uninstall your program, but it he finds it and if you can uninstall it can even erase files that cannot be deleted by windows. I guess there is no need to repair or reinstall Windows Installer.

    http://www.revouninstaller.com/download-professional-version.php

    Good luck!

  • Installation of Acrobat DC on Mac fails with the message "Host_Authfail".

    I'm trying to install Acrobat DC on MacBook Pro.

    Image uploaded for the installation program appears successful.  When I try to run it to complete the installation, I get a cryptic dialog box that says Host_Authfail".

    The operating system must be the issue.  Fortunately, I have two identical Macbook Pro with different versions of the OS.  Here is the result:

    10.11 beta 3 (El Capitan) - installation fails as stated above

    10.10 (yosemite) - successful installation

    Sorry, I forgot that I was running the beta when I reported the problem.  It seems that this is the problem. I hope this will get sorted the beta moves along.

  • After installation first boot failed with the message: cannot open the volume, because the file is locked, you quite accessrights...

    After installation first boot failed with the message: cannot open the volume, because the file is locked, you quite accessrights...

    What can I do?

    Have you tried what he says in the link I provided?

    or

    A chat session where an agent can remotely look inside your computer can help

    Cloud creative support chat (all creative cloud customer service problems)

    http://helpx.Adobe.com/x-productkb/global/service-CCM.html

  • KB2518870 and KB2539636 always fail with the message Code 643 and has Code 66

    Security for Microsoft .NET Framework 4 updates on... Windows Vista... KB2518870 and KB2539636 always fail with the message Code 643 and Code 66 has.  I can't find these codes or the reasons for these failures.  This happened for well over a month now.  They are reported as of the important updates, but won't install but no problem with the other updates.  Should I be worried?  Is there a solution to this problem?

    Thank you, but it doesn't work anymore. CD don't has not given me the possibility to upgrade the existing installation, so I had to reinstall the system...
    Kind regards
    Ricardo
  • Oh, Snap! Build request failed with the message: error

    Hello!

    I am working on an app for BlackBerry Playbook with WebWorks.  When I try to package it I get the error in the subject (Oh Snap! Application of Build failed with the message: error).  There is no more information.  I googled but can't find anyone else with this particular problem.

    Is there a log somewhere that I can read to see what is happening?  Everyone knows this?

    Thanks for any help!

    Oh, I almost forgot.  When I go into the output folder, the .zip file is there, but not the .bar file.

    Ok.  I finally found the code in command line to compile applications.  Here it is for others and reference later: first move the location of the bbwp directory, then run the command bbwp.

    CD "C:\Program Search SDK for Tablet \bbwp Motion\BlackBerry WebWorks"

    bbwp 'C:\myapp.zip '.

    Here is the link where I got the information of: https://bdsc.webapps.blackberry.com/html5/downloads/sdk, then click on "how to get running.

    For those looking to sign their application from the terminal, it is also possible.  First set up your computer, as described here: https://bdsc.webapps.blackberry.com/html5/documentation/ww_publishing/signing_setup_tablet_apps_1920...

    Then go into the same directory 'bbwp' as we did above.  Finally, run this command:

    bbwp g - buildId o

    This information can be found here: https://bdsc.webapps.blackberry.com/html5/documentation/ww_publishing/signing_your_tablet_app_191966...

    Sorry for that write when it is already available elsewhere on the web, but I feel like I should post the complete response for those who come across this message later.  I hope it can help someone who has the same problem as me.

  • Build request failed with the message: error: ENOENT, untie

    I use emulator ripple to package the application for Blackberry os 7...
    But when I press the button package it gives me error as follows:

    Oh, Snap! Build request failed with the message: error: ENOENT, remove the link "C:\Documents and Settings\AtikJ\RippleSites\AgriQuote\packaged\AgriQuoteApp.zip".

    Duplicate of:
    http://supportforums.BlackBerry.com/T5/Web-and-WebWorks-development/error-while-packaging-the-app-us...

  • Oh, Snap! Build request failed with the message: [ERROR] CAP exception has occurred

    Hello. Pls I just got the error "Oh Snap!" "Build request failed with the message: [ERROR] CAP exception occurred" when I tried a test package ' Helloworld ' procedure follwing illustrated app on "http://developer.blackberry.com/bbos/html5/documentation/creating_hello_world.html."

    I need your help pls.

    Hello!

    Thank you for your response. I uninstalled "jdk-7u25-windows-i58" and got 'jdk-6u35-windows-i586', and his work well at the moment. I hope that I have no problem to use an older version.

  • Build request failed with the message: helloWorld/Dokumente / is not a valid path

    Hello

    Unfortunately ripple does not work under Windows 7, so I tried on Mac. On Mac, I have the following parameters in the ripple:
    SDK path: / Developer/SDKs/Research in Motion/BlackBerry WebWorks SDK 2.3.1.5
    The project root: / Dokumente/helloWorld
    Archive name: helloWorld
    Output folder: / Dokumente/BlackBerryOutput

    There is the file config.xml and index.html file in the helloWorld file

    I have for this site:

    https://bdsc.webapps.BlackBerry.com/HTML5/documentation/ww_getting_started/creating_an_app_1885567_1...

    When I try to pack in ripple, I get:
    Build request failed with the message: helloWorld/Dokumente / is not a valid path

    There is a message ' no simulators found "on the bottom of the settings, too." '

    I tried different paths, one of my localhost in Apache, but nothing works. What's wrong??

    Well, the path was not "consistent". I hate the f... Mac: / Users/Valentina/Documents/helloWorld to the project root and/Users/Valentina/Documents/BlackBerryOutput was necessary.

    Just in case somebody stumbles on the same problem.

  • Ripple packaging error: Oh, Snap! Build request failed with the message: zip i/o error: no zip file or directory error: could not create output file

    I am trying to package and sign an application with ripple and I get this error: Oh, Snap! Build request failed with the message: zip i/o error: no zip file or directory error: could not create output file

    What can possibly be the problem here?

    Solved!

    I had the field output folder of the same value as the name of the archive

  • error packaed and launch: Oh, Snap! Build request failed with the message: [ERROR] an archive or directory does not exist in the specified path:

    Hello

    I get this error when you try to run the sample of cards on the corrugation Simulator:

    Oh, Snap! Build request failed with the message: [ERROR] an archive or directory does not exist in the specified path: "/ Users/Calgacos/Library/Application Support/Google/Chrome/Default/Extensions/cnijnnaimeaacneklcndcafbnkeicckh/0.9.16_0/services/node/node_modules/rbd/Packaged/Maps.zip".

    The .../rbd/Packaged folder is writable and the Maps.zip will be created in the folder ~/RippleSites/Maps/Packaged.  With the help of Mac, the latest versions of everything.  The application runs in undulation ok, but I can't throw on the SIM BB10.

    Someone else have this error and know why?

    PS the Maps.zip does not get created (or copied) in specified folder, of course, but why?

    PS try another application and it worked but is too has not put its zip file into the folder... rbd/Packaged.  I guess it should not but leaves me clueless as to whats wrong with cards.

    Thank you

    The two directories (in the extensions directory and maps project directory) have permissions to 777.

    But you gave me an idea...

    It turns out that simply by putting

    "Packages".

    in setting output wasn't enough, I need the full path

    for example: "/ Users/username/RippleSites/Maps/packed."

    and presto, now it works!

    Thank you!

  • IAM-2050243: process Orchestration with the id 498509, failed with the IAM-3051103 error message: failed to create operation on the entity user at the point of action

    Hello

    While creating a use to the IOM, I get the error below. I have to configure?

    oracle.iam.ui.platform.exception.OIMRuntimeException: IAM-2050243: process of Orchestration with the id 498509, failed with the IAM-3051103 error message: failed to create operation on the entity user at the point of action

    Error log file:

    ]]

    [2015 07-28 T 12: 53:51.674 - 07:00] [oimext_server1] [NOTIFICATION] [] [oracle.iam.identity.usermgmt.impl.handlers.base] [tid: [ASSETS].] [' ExecuteThread: ' 74 ' for queue: "(self-adjusting) weblogic.kernel.Default"] [username: xelsysadm] [ecid: 77744a889dde03de:77dc1a7d:14ec20555f9:-8000-000000000099b7c8, 0] [APP: IOM #11.1.2.0.0] [IDDM: 0000KvMCNcVEoIs6wjyWMG1Lgf5y00000k] compensate the method called in a process of running User Manager CREATE with process Id 498 509 and Event Id 3 306 663

    [2015 07-28 T 12: 53:51.703 - 07:00] [oimext_server1] [NOTIFICATION] [LIBOVD-20043] [oracle.ods.virtualization.accesslog] [tid: [ASSETS].] [' ExecuteThread: ' 74 ' for queue: "(self-adjusting) weblogic.kernel.Default"] [userId: xelsysadm] [ecid: 77744a889dde03de:77dc1a7d:14ec20555f9:-8000-000000000099b7c8, 0] [APP: IOM #11.1.2.0.0] [IDDM: 0000KvMCNcVEoIs6wjyWMG1Lgf5y00000k] conn = op 78 = basic 207 SRCH = scope = base filter = objectclass = * requestedAttributes = [] sizelimit = 0 timelimit = 0 typesOnly = false

    [2015 07-28 T 12: 53:51.703 - 07:00] [oimext_server1] [NOTIFICATION] [LIBOVD-20044] [oracle.ods.virtualization.accesslog] [tid: [ASSETS].] [' ExecuteThread: ' 74 ' for queue: "(self-adjusting) weblogic.kernel.Default"] [userId: xelsysadm] [ecid: 77744a889dde03de:77dc1a7d:14ec20555f9:-8000-000000000099b7c8, 0] [APP: IOM #11.1.2.0.0] [IDDM: 0000KvMCNcVEoIs6wjyWMG1Lgf5y00000k] conn = op 78 = 207 RESULT err = 0 tag = 0 nentries = 1 etime = 0 = 0 mem = 2, 058, 395 728 dbtime / 4294967296

    [2015 07-28 T 12: 53:51.703 - 07:00] [oimext_server1] [NOTIFICATION] [LIBOVD-20043] [oracle.ods.virtualization.accesslog] [tid: [ASSETS].] [' ExecuteThread: ' 74 ' for queue: "(self-adjusting) weblogic.kernel.Default"] [userId: xelsysadm] [ecid: 77744a889dde03de:77dc1a7d:14ec20555f9:-8000-000000000099b7c8, 0] [APP: IOM #11.1.2.0.0] [IDDM: 0000KvMCNcVEoIs6wjyWMG1Lgf5y00000k] conn = op 78 = basic 208 SRCH = scope = base filter = objectclass = * = sizelimit timelimit [] = 0 requestedAttributes = 0 typesOnly = false

    [2015 07-28 T 12: 53:51.703 - 07:00] [oimext_server1] [NOTIFICATION] [LIBOVD-20044] [oracle.ods.virtualization.accesslog] [tid: [ASSETS].] [' ExecuteThread: ' 74 ' for queue: "(self-adjusting) weblogic.kernel.Default"] [userId: xelsysadm] [ecid: 77744a889dde03de:77dc1a7d:14ec20555f9:-8000-000000000099b7c8, 0] [APP: IOM #11.1.2.0.0] [IDDM: 0000KvMCNcVEoIs6wjyWMG1Lgf5y00000k] conn = op 78 = 208 RESULT err = 0 tag = 0 nentries = 1 etime = 0 = 0 mem = 2, 058, 395 728 dbtime / 4294967296

    [2015 07-28 T 12: 53:51.703 - 07:00] [oimext_server1] [NOTIFICATION] [LIBOVD-20043] [oracle.ods.virtualization.accesslog] [tid: [ASSETS].] [' ExecuteThread: ' 74 ' for queue: "(self-adjusting) weblogic.kernel.Default"] [userId: xelsysadm] [ecid: 77744a889dde03de:77dc1a7d:14ec20555f9:-8000-000000000099b7c8, 0] [APP: IOM #11.1.2.0.0] [IDDM: 0000KvMCNcVEoIs6wjyWMG1Lgf5y00000k] conn = op 78 = base 209 SRCH = xxxxxxxxxx, dc = net scope = filter sub = orclguid = 56ca2d28625f47819064b8241ab44539 requestedAttributes = [orclguid] = 0 = 0 = false typesOnly timelimit sizelimit

    [2015 07-28 T 12: 53:51.705 - 07:00] [oimext_server1] [NOTIFICATION] [LIBOVD-20044] [oracle.ods.virtualization.accesslog] [tid: [ASSETS].] [' ExecuteThread: ' 74 ' for queue: "(self-adjusting) weblogic.kernel.Default"] [userId: xelsysadm] [ecid: 77744a889dde03de:77dc1a7d:14ec20555f9:-8000-000000000099b7c8, 0] [APP: IOM #11.1.2.0.0] [IDDM: 0000KvMCNcVEoIs6wjyWMG1Lgf5y00000k] conn = op 78 = 209 RESULT err = 0 tag = 0 = 1 = 2 = 0 = 2 mem dbtime etime nentries, 058, 395 728 / 4294967296

    [2015 07-28 T 12: 53:51.705 - 07:00] [oimext_server1] [NOTIFICATION] [LIBOVD-20040] [oracle.ods.virtualization.accesslog] [tid: [ASSETS].] [' ExecuteThread: ' 74 ' for queue: "(self-adjusting) weblogic.kernel.Default"] [username: xelsysadm] [ecid: 77744a889dde03de:77dc1a7d:14ec20555f9:-8000-000000000099b7c8, 0] [APP: IOM #11.1.2.0.0] [IDDM: 0000KvMCNcVEoIs6wjyWMG1Lgf5y00000k] conn = op 78 = 210 DEL dn = cn = afdada, cn = users, xxxxxxxxxx, dc is net

    [2015 07-28 T 12: 53:51.709 - 07:00] [oimext_server1] [NOTIFICATION] [LIBOVD-20039] [oracle.ods.virtualization.accesslog] [tid: [ASSETS].] [' ExecuteThread: ' 74 ' for queue: "(self-adjusting) weblogic.kernel.Default"] [userId: xelsysadm] [ecid: 77744a889dde03de:77dc1a7d:14ec20555f9:-8000-000000000099b7c8, 0] [APP: IOM #11.1.2.0.0] [IDDM: 0000KvMCNcVEoIs6wjyWMG1Lgf5y00000k] conn = op 78 = 210 RESULT tag = 0 = 0 = 4 etime nentries err = 0

    [2015 07-28 T 12: 53:51.723 - 07:00] [oimext_server1] [NOTIFICATION] [] [oracle.iam.identity.usermgmt.impl.handlers.custom] [tid: [ASSETS].] [' ExecuteThread: ' 74 ' for queue: "(self-adjusting) weblogic.kernel.Default"] [username: xelsysadm] [ecid: 77744a889dde03de:77dc1a7d:14ec20555f9:-8000-000000000099b7c8, 0] [APP: IOM #11.1.2.0.0] [IDDM: 0000KvMCNcVEoIs6wjyWMG1Lgf5y00000k] compensate the method called in a process of running User Manager CREATE with process Id 498 509 and Event Id 3 658 306

    [2015 07-28 T 12: 53:51.763 - 07:00] [oimext_server1] [NOTIFICATION] [] [oracle.iam.platform.kernel.impl] [tid: [ASSETS].] [' ExecuteThread: ' 74 ' for queue: "(self-adjusting) weblogic.kernel.Default"] [userId: xelsysadm] [ecid: 77744a889dde03de:77dc1a7d:14ec20555f9:-8000-000000000099b7c8, 0] [APP: IOM #11.1.2.0.0] [IDDM: 0000KvMCNcVEoIs6wjyWMG1Lgf5y00000k] completed the orchestration with the result of the action - oracle.iam.platform.kernel.EventFailedException: IAM-3051103: failure of the create operation on the entity user at the point of action. :

    [2015 07-28 T 12: 53:51.775 - 07:00] [oimext_server1] [ERROR] [] [oracle.iam.request.impl] [tid: [ASSETS].] [' ExecuteThread: ' 74 ' for queue: "(self-adjusting) weblogic.kernel.Default"] [username: xelsysadm] [ecid: 77744a889dde03de:77dc1a7d:14ec20555f9:-8000-000000000099b7c8, 0] [APP: IOM #11.1.2.0.0] [IDDM: 0000KvMCNcVEoIs6wjyWMG1Lgf5y00000k] Orchestration process with id 498509, failed with the IAM-3051103 error message: failed to create operation on the entity user at the point of action. :.

    [2015 07-28 T 12: 53:51.784 - 07:00] [oimext_server1] [WARNING] [] [oracle.adf.controller.faces.lifecycle.Utils] [tid: [ASSETS].] [' ExecuteThread: ' 74 ' for queue: "(self-adjusting) weblogic.kernel.Default"] [userId: xelsysadm] [ecid: 77744a889dde03de:77dc1a7d:14ec20555f9:-8000-000000000099b7c8, 0] [APP: oracle.iam.console.identity.self-service.ear #V2.0] [IDDM: 0000KvMCNcVEoIs6wjyWMG1Lgf5y00000k] ADF: adding the following JSF error message: IAM-2050243: Orchestration process with id 498509, failed with the IAM-3051103 error message: failed to create operation on the entity user at the stage of the action... [[

    oracle.iam.ui.platform.exception.OIMRuntimeException: IAM-2050243: process of Orchestration with the id 498509, failed with the IAM-3051103 error message: failed to create operation on the entity user at the stage of the action...

    at oracle.iam.ui.platform.exception.OIMErrorHandler.reportServiceException(OIMErrorHandler.java:171)

    at oracle.iam.ui.platform.exception.OIMErrorHandler.reportException(OIMErrorHandler.java:65)

    at oracle.adf.model.binding.DCDataControl.reportException(DCDataControl.java:411)

    at oracle.adf.model.binding.DCBindingContainer.reportException(DCBindingContainer.java:424)

    at oracle.adf.model.binding.DCBindingContainer.reportException(DCBindingContainer.java:479)

    at oracle.adf.model.binding.DCControlBinding.reportException(DCControlBinding.java:201)

    at oracle.jbo.uicli.binding.JUCtrlActionBinding.reportException(JUCtrlActionBinding.java:2036)

    at oracle.jbo.uicli.binding.JUCtrlActionBinding.doIt(JUCtrlActionBinding.java:1680)

    at oracle.adf.model.binding.DCDataControl.invokeOperation(DCDataControl.java:2150)

    at oracle.jbo.uicli.binding.JUCtrlActionBinding.invoke(JUCtrlActionBinding.java:760)

    at oracle.adf.controller.v2.lifecycle.PageLifecycleImpl.executeEvent(PageLifecycleImpl.java:407)

    at oracle.adfinternal.view.faces.model.binding.FacesCtrlActionBinding._execute(FacesCtrlActionBinding.java:252)

    at oracle.adfinternal.view.faces.model.binding.FacesCtrlActionBinding.execute(FacesCtrlActionBinding.java:210)

    at oracle.iam.ui.platform.utils.FacesUtils.executeOperationBinding(FacesUtils.java:169)

    at oracle.iam.ui.platform.utils.FacesUtils.executeOperationBindingFromActionListener(FacesUtils.java:116)

    at oracle.iam.ui.catalog.view.backing.CartReqBean.submit(CartReqBean.java:980)

    at oracle.iam.ui.catalog.view.backing.CartReqBean.submitActionListener(CartReqBean.java:919)

    at sun.reflect.NativeMethodAccessorImpl.invoke0 (Native Method)

    at sun.reflect.NativeMethodAccessorImpl.invoke(NativeMethodAccessorImpl.java:39)

    at sun.reflect.DelegatingMethodAccessorImpl.invoke(DelegatingMethodAccessorImpl.java:25)

    at java.lang.reflect.Method.invoke(Method.java:597)

    at com.sun.el.parser.AstValue.invoke(AstValue.java:187)

    at com.sun.el.MethodExpressionImpl.invoke(MethodExpressionImpl.java:297)

    at org.apache.myfaces.trinidadinternal.taglib.util.MethodExpressionMethodBinding.invoke(MethodExpressionMethodBinding.java:53)

    at org.apache.myfaces.trinidad.component.UIXComponentBase.broadcastToMethodBinding(UIXComponentBase.java:1490)

    at org.apache.myfaces.trinidad.component.UIXCommand.broadcast(UIXCommand.java:183)

    at oracle.adf.view.rich.component.fragment.UIXRegion.broadcast(UIXRegion.java:181)

    at oracle.adf.view.rich.component.fragment.UIXInclude.broadcast(UIXInclude.java:104)

    to oracle.adf.view.rich.component.fragment.ContextSwitchingComponent$ 1.run(ContextSwitchingComponent.java:93)

    at oracle.adf.view.rich.component.fragment.ContextSwitchingComponent._processPhase(ContextSwitchingComponent.java:371)

    at oracle.adf.view.rich.component.fragment.ContextSwitchingComponent.broadcast(ContextSwitchingComponent.java:97)

    at oracle.adf.view.rich.component.fragment.UIXInclude.broadcast(UIXInclude.java:98)

    at oracle.adfinternal.view.faces.lifecycle.LifecycleImpl.broadcastEvents(LifecycleImpl.java:1086)

    at oracle.adfinternal.view.faces.lifecycle.LifecycleImpl._executePhase(LifecycleImpl.java:434)

    at oracle.adfinternal.view.faces.lifecycle.LifecycleImpl.execute(LifecycleImpl.java:207)

    at javax.faces.webapp.FacesServlet.service(FacesServlet.java:265)

    to weblogic.servlet.internal.StubSecurityHelper$ ServletServiceAction.run (StubSecurityHelper.java:227)

    at weblogic.servlet.internal.StubSecurityHelper.invokeServlet(StubSecurityHelper.java:125)

    at weblogic.servlet.internal.ServletStubImpl.execute(ServletStubImpl.java:301)

    at weblogic.servlet.internal.TailFilter.doFilter(TailFilter.java:26)

    at weblogic.servlet.internal.FilterChainImpl.doFilter(FilterChainImpl.java:56)

    at oracle.help.web.rich.OHWFilter.doFilter (unknown Source)

    at weblogic.servlet.internal.FilterChainImpl.doFilter(FilterChainImpl.java:56)

    at oracle.adf.model.servlet.ADFBindingFilter.doFilter(ADFBindingFilter.java:205)

    at weblogic.servlet.internal.FilterChainImpl.doFilter(FilterChainImpl.java:56)

    at oracle.adf.view.page.editor.webapp.WebCenterComposerFilter.doFilter(WebCenterComposerFilter.java:117)

    at weblogic.servlet.internal.FilterChainImpl.doFilter(FilterChainImpl.java:56)

    at oracle.adfinternal.view.faces.webapp.rich.RegistrationFilter.doFilter(RegistrationFilter.java:128)

    to org.apache.myfaces.trinidadinternal.webapp.TrinidadFilterImpl$ FilterListChain.doFilter (TrinidadFilterImpl.java:446)

    at oracle.adfinternal.view.faces.activedata.AdsFilter.doFilter(AdsFilter.java:60)

    to org.apache.myfaces.trinidadinternal.webapp.TrinidadFilterImpl$ FilterListChain.doFilter (TrinidadFilterImpl.java:446)

    at org.apache.myfaces.trinidadinternal.webapp.TrinidadFilterImpl._doFilterImpl(TrinidadFilterImpl.java:271)

    at org.apache.myfaces.trinidadinternal.webapp.TrinidadFilterImpl.doFilter(TrinidadFilterImpl.java:177)

    at org.apache.myfaces.trinidad.webapp.TrinidadFilter.doFilter(TrinidadFilter.java:92)

    at weblogic.servlet.internal.FilterChainImpl.doFilter(FilterChainImpl.java:56)

    at oracle.iam.ui.platform.servletfilter.IdentityContextFilter.doFilter(IdentityContextFilter.java:50)

    at weblogic.servlet.internal.FilterChainImpl.doFilter(FilterChainImpl.java:56)

    at oracle.iam.platform.servletfilter.PwdMgmtNavigationFilter.doFilter(PwdMgmtNavigationFilter.java:164)

    at weblogic.servlet.internal.FilterChainImpl.doFilter(FilterChainImpl.java:56)

    at oracle.bpel.services.workflow.client.worklist.util.WorkflowFilter.doFilter(WorkflowFilter.java:175)

    at weblogic.servlet.internal.FilterChainImpl.doFilter(FilterChainImpl.java:56)

    at oracle.bpel.services.workflow.client.worklist.util.DisableUrlSessionFilter.doFilter(DisableUrlSessionFilter.java:70)

    at weblogic.servlet.internal.FilterChainImpl.doFilter(FilterChainImpl.java:56)

    at oracle.adf.library.webapp.LibraryFilter.doFilter(LibraryFilter.java:180)

    at weblogic.servlet.internal.FilterChainImpl.doFilter(FilterChainImpl.java:56)

    to oracle.security.jps.ee.http.JpsAbsFilter$ 1.run(JpsAbsFilter.java:119)

    at oracle.security.jps.util.JpsSubject.doAsPrivileged(JpsSubject.java:324)

    at oracle.security.jps.ee.util.JpsPlatformUtil.runJaasMode(JpsPlatformUtil.java:460)

    at oracle.security.jps.ee.http.JpsAbsFilter.runJaasMode(JpsAbsFilter.java:103)

    at oracle.security.jps.ee.http.JpsAbsFilter.doFilter(JpsAbsFilter.java:171)

    at oracle.security.jps.ee.http.JpsFilter.doFilter(JpsFilter.java:71)

    at weblogic.servlet.internal.FilterChainImpl.doFilter(FilterChainImpl.java:56)

    at oracle.security.wls.filter.SSOSessionSynchronizationFilter.doFilter(SSOSessionSynchronizationFilter.java:418)

    at weblogic.servlet.internal.FilterChainImpl.doFilter(FilterChainImpl.java:56)

    at oracle.security.am.agent.wls.filters.OAMServletAuthenticationFilter.doFilter(OAMServletAuthenticationFilter.java:265)

    at oracle.security.am.agent.wls.filters.OAMValidationSystemFilter.doFilter(OAMValidationSystemFilter.java:133)

    at oracle.security.wls.oamagent.OAMAgentWrapperFilter.doFilter(OAMAgentWrapperFilter.java:120)

    at weblogic.servlet.internal.FilterChainImpl.doFilter(FilterChainImpl.java:56)

    at oracle.dms.servlet.DMSServletFilter.doFilter(DMSServletFilter.java:163)

    at weblogic.servlet.internal.FilterChainImpl.doFilter(FilterChainImpl.java:56)

    at weblogic.servlet.internal.RequestEventsFilter.doFilter(RequestEventsFilter.java:27)

    at weblogic.servlet.internal.FilterChainImpl.doFilter(FilterChainImpl.java:56)

    to weblogic.servlet.internal.WebAppServletContext$ ServletInvocationAction.wrapRun (WebAppServletContext.java:3730)

    to weblogic.servlet.internal.WebAppServletContext$ ServletInvocationAction.run (WebAppServletContext.java:3696)

    at weblogic.security.acl.internal.AuthenticatedSubject.doAs(AuthenticatedSubject.java:321)

    at weblogic.security.service.SecurityManager.runAs(SecurityManager.java:120)

    at weblogic.servlet.internal.WebAppServletContext.securedExecute(WebAppServletContext.java:2273)

    at weblogic.servlet.internal.WebAppServletContext.execute(WebAppServletContext.java:2179)

    at weblogic.servlet.internal.ServletRequestImpl.run(ServletRequestImpl.java:1485)

    at weblogic.work.ExecuteThread.execute(ExecuteThread.java:256)

    at weblogic.work.ExecuteThread.run(ExecuteThread.java:221)

    Thank you

    As IOM tablespace maxed out, we were receving a lot of mistakes. It was one of them.

    Thank you Anne for your contributions.

  • Installation of the printer driver Officejet G85 fails with the message "print processor does not exist" with Windows 7

    The site compatibility Windows 7 says that this OS is compatible with my Officejet G85 all-in-one old.  Whenever I try to add this printer is using the automatic functions or manual installation of the driver fails and I get the error message that "print processor does not exist.  I tried to install the original with the most recent compatibility software is Windows 2000, but Windows 7 does not allow indicating that the program already exists and I have to uninstall it first.  However, I can't find it listed anywhere for uninstall it, and the original software disk does not have this feature either.  HP does not support printer and would not help provide.  This printer worked perfectly with Windows XP and we really like it is equipped.  Please help us raise this printer up and running with Windows 7 64 bit home edition.  I tried things I found that it was similar in the forum with no success so far.

    Hello

    You can run the printer troubleshooter. Convenience store solves some common printing problems.

    If your computer has problems printing, try using the printer Troubleshooter to solve the problem. He made sure that a printer is connected to your computer, and it checks for common issues such as whether the printer has enough paper and toner to complete printing your document.

    Open the printer Troubleshooter by clicking the Start button, then Control Panel. In the search box, type troubleshooting, and then click Troubleshooting. Under hardware and sound, click on use printer.

    Reference:

    Open the printer Troubleshooter
    http://Windows.Microsoft.com/en-us/Windows7/open-the-printer-Troubleshooter

    See the following articles from Microsoft for more information on installing a printer or driver printer:

    Install a printer
    http://Windows.Microsoft.com/en-us/Windows7/install-a-printer

    Find and install printer drivers
    http://Windows.Microsoft.com/en-us/Windows7/find-and-install-printer-drivers

    If the problem persists, you can contact the manufacturer of the printer for more information.

    http://WWW8.HP.com/ca/en/support-drivers.html

    Hope this information helps.

  • system recovery fails with the C++ runtime error

    My Compaq CQ610-410US Windows 7 running is unusable. When you use the system recovery, either from CD or recovery, it fails with C++ runtime library program not found contact HP support. Whatever it is, Windows is loaded and the system restore screens appear. Once I answer to remove all the accessories it fails with run-time error. Two questions: (1) is there a way around it? (2) get new disks from HP recovery even work?

    All I can suggest is to order a set of HP and I hope they work. This error is not a municipality and the provided HP recovery discs should work.

  • Error of the ripple: Oh Snap! Build request failed with the message: CreateProcessW

    Hello

    I installed the Mobile Emulator 0.9.1 ripple with SDK for Tablet 2.2.0.5 WebWorks, following the instructions exacly on a Windows 7 64-bit machine.

    If I try to package virtually any application (HelloWorld, weather, examples, something more complex, whatever), I get the following error:

    Oh Snap! Build request failed with message: CreateProcessW: The system cannot find the file specified.
    

    I tried a lot of things. I'm guessing that it's a mistake with the SDK, since I can enter any path to any folder that exists on my HD as the path to the SDK and I get the same error.

    Path SDK: SDK for Tablet 2.2.0.5 WebWorks c:\RIM\BlackBerry

    The project root: c:\Users\Username\RippleSites\AppName

    Archive name: AppName

    Output folder: c:\

    I tried different paths for the foregoing, moving my code and by reinstalling the SDK.

    I'm at my wits end - about to renounce WebWorks.  Any ideas? 

    It seems %SystemRoot%/system32 and any % were missing from my path variable. All good - too bad!

    Land

Maybe you are looking for

  • How can I configure things if a program runs automatically at startup?

    I have a video surveillance program, I would have run automatically using my UID, not root login, when starting my Mini (its running OS X 10.11).  What is the best way to do it?

  • Y at - it a button to avoid having the explicit songs to play?

    I like listening to iTunes while at work and my co-workers generally enjoy listening too. The question I constantly meet is inappropriate explicit lyrics. Have you developed a framework or switch check that will remove the explicit versions of songs?

  • S1 Yoga - how to disable the built-in screen/monitor?

    Hello Try to find a way/hotkey to turn off the built-in screen while I'm connected to another external monitor with the Thinkpad S1 Yoga model. Do you know guys how to do? I might even remap all keys shortcut by default, if anyone knows how do Simila

  • dv4000 - partition image factory

    I got an old Pavilion dv4000 which does not work well. When it launches the application guests: «Manager of Acronis loader...» ». but F11 have no influence. I want to erase the disc and go back to the ORIGINAL IMAGE. If I take the HARD drive and conn

  • Computer does not recognize device not

    I have a M250, my computer uses Windows XP and he can't seem to detect that the device is connected. I know that my USB ports all work, I've tested with my camera. I managed to get the camera to recognize once. Now, I have three songs together on thi