major error with the structure of the event

IM under LABVIEW 13.0 PRO

I don't know when this strarted bug happening, but now when I add a business to a structure of the event. Freezes in LabVIEW. I have to close labview with the Task Manager.

It doesn't matter what code I'm working with, even a new VI, with nothing else than a structure of the event.

I tried this on my desktop PC, my laptop and my CPU DAQ.

The error occurs on my desktop and my laptop. But it does not occur on my CPU DAQ.

Whenever I click on add event usually case, you get a popup to configure and add cases, but with the popup error never comes to the top and labview crashes.

Theres no code to share the problem ocured when adding events to the event structure. It happened with any structure of the event, in any code, all the time.

I spoke to an engineer of apllication of labview and suggested to delete the labview.ini file located in the installation of labview directory. I did this and the problem was solved.

Still not sure what caused this to happen.

Tags: NI Software

Similar Questions

  • Satellite L350-214 - error with the software Reeltime

    Hello

    I have a Satellite L350-214 with Windows 7 Pro and have encountered an error with the software Reeltime, I uninstalled and reinstalled and still get the error below. Any help or assistance would be great

    Tony Miller

    Log name: Application
    Source: Windows Error Reporting
    Date: 2010-11-30 12:27:58
    Event ID: 1001
    Task category: no
    Level: Information
    Keywords: Classic
    User: n/a
    Computer: Tony-TOSH
    Description:
    Fault bucket 1223018385, type 5
    Event name: CLR20r3
    Answer: No available
    Cabin ID: 0
    Signature of the problem:
    P1: tosreeltime.exe
    P2: 1.0.0.0
    P3: 4a769d0e
    P4: WindowsBase
    P5: 3.0.0.0
    P6: 4b5950b7
    P7: a86
    P8: 18
    P9: System.InvalidOperationException
    P10:
    Attached files:
    C:\Users\Tony\AppData\Local\Temp\WER7C9E.tmp.WERIn ternalMetadata.xml
    These files are available here:
    C:\Users\Tony\AppData\Local\Microsoft\Windows\WER\ ReportArchive\AppCrash_tosreeltime.exe_25c5a6496c7 ad44943ce88637e3389e8a80bd45_07f0c745
    Symbol of the analysis:
    Recheck for solution: 0
    Report ID: d5b71327-fc74-11df-a596-00266c333aed
    State: 0
    The event XML:



    1001
    4
    0
    0 x 80000000000000

    37886
    Application
    Tony-TOSH



    1223018385
    5
    CLR20r3
    Not available
    0
    tosreeltime.exe
    1.0.0.0
    4a769d0e
    WindowsBase
    3.0.0.0
    4b5950b7
    A86
    18
    System.InvalidOperationException



    C:\Users\Tony\AppData\Local\Temp\WER7C9E.tmp.WERIn ternalMetadata.xml

    C:\Users\Tony\AppData\Local\Microsoft\Window s\WER\ReportArchive\AppCrash_tosreeltime.exe_25c5a 6496c7ad44943ce88637e3389e8a80bd45_07f0c745


    0
    d5b71327-fc74-11df-A596-00266c333aed
    0


    My system specs

    Hey,.

    If you get this error Reeltime, you should try Ccleaner. There may be a registry problem and CCleaner might solve this problem. This great freeware and easy tool which you can download here:
    http://www.Piriform.com/

    Check this box!

  • Problem with the event

    Hello
    I am facing a problem with the events. Please Ref. Event.zip the attachment.

    AEv.vi is a LV2G used for the reading/Generate/Init/destroy the event. Test2.VI is a main vi (we must run this vi)

    The AEv.vi Init action must be done in the other vi (other than the Test2.vi:- but for the objective test I've initialized in Test2.vi only).

    Test2.VI is used for genetate event.

    I could have called statically AEv.vi inside the Test2.vi to generate an event... but the path that comes is decided when running... (I have many live similar to AEv.vi...) .. who decided at run time...)

    The problem:

    When I run Test2.vi, it gives me the error code 1 (try running test2.VI... it gives the dialogue on the occurrence of the error)...

    Can someone fix this?

    Thank you!

    I modified your screws to do what I think you want.  The way you did the user events will not work.  I added a line to send orders to Ev.vi

  • How to fix the error with the code: 0xe7210001 failed to load powrprof, object: cls

    Hello

    Dose anyone know how to fix the error with the code: 0xe7210001, message: unable to load powrprof, object: CLSD-no-it is found;
    OR: Fingerprintsoftware OR error: replicas THotkey.exe message window and the computer freezes

    Maleware scanned and virus, also in safe mode, found no infection, reinstalled driver fingerprint, but nothing has changed.

    grateful for the help!

    Hello

    > message: unable to load powrprof, object: CLSD-no-it is found;
    In my view, this would mean that there is a problem with Toshiba Power Saver
    What laptop Toshiba, you have exactly?

    Maybe reinstall Power Saver could help. You can find it on the official website of Toshiba.

  • Flight Simulator 2004 install stops at 97% say there is an error with the file world.cab

    While the resettlement of fs2004, the installation stops at 97% saying there is an error with the file world.cab, this damaged disc 4.  Someone at - he found a solution to this?

    Thank you

    Well, if, as you say, the disc is damaged. The solution would be to get another drive.

    Although I would have a look at the following:

    Take a look at the following: http://support.microsoft.com/kb/258496

    I hope that, if necessary, you can get a free replacement disc.

  • Get "I/o Error" with the 0x8078002A error code when I start a backup.

    * Original title: IO Error Message - I am an amateur

    When I start a backup of my hard drive to my external hard drive, I get an error that reads "I/o Error" with the 0x8078002A error code.  I am a real novice.  I can do either fix it or work around this problem?

    Hello

    Welcome to the Microsoft community.

    Try the steps in these articles:

    Error message when you try to perform a full backup on a Windows Vista-based computer: "" the request could not be performed because of an i/o device error".
    http://support.Microsoft.com/kb/952272
    Note: It is applicable for Windows 7 as well.

    Perform a clean boot:

    How to troubleshoot a problem by performing a clean boot in Windows Vista or in Windows 7
    http://support.Microsoft.com/kb/929135
    Note: After a repair, be sure to set the computer to start as usual as mentioned in step 7 in the Knowledge Base article.

  • How reslove an error with the dbms_redefinition.start_redef_table command?

    Command:

    BEGIN

    () DBMS_REDEFINITION.start_redef_table

    uname = > "kiku"

    orig_table = > 'pletest3_pn_kiku_api_db ',.

    int_table = > 'pletest4_pn_kiku_api_db');

    END;

    Error:

    Error report:

    ORA-12008: error path refresh materialized view

    ORA-14400: inserted partition key is not mapped with any partition

    ORA-06512: at "SYS." DBMS_REDEFINITION", line 50

    ORA-06512: at "SYS." DBMS_REDEFINITION", line 1343

    ORA-06512: at line 2

    12008 00000 - "error in the path of refresh materialized view.

    * Cause: Table SNAP$ _ < mview_name > reads lines of sight

    MVIEW$ _ < mview_name >, which is a view of the main table

    (the master can be on a remote site).  Any

    error in this way will cause this error when updating.

    For updates of the Rapids, the table < master_owner >. MLOG$ _ < master >

    is also referenced.

    * Action: Examine the other messages on the stack to find the problem.

    See if SNAP objects $ _ < mview_name >, MVIEW$ _ < mview_name >.

    < mowner >. < master > @ < dblink >, < mowner >. MLOG$ _ < master > @ < dblink >

    There is always.

    How reslove an error with the dbms_redefinition.start_redef_table command?

    As I said before, this may be reproduced if the intermediate table is not created correctly.

    SQL> --My database version.
    SQL> ----------------------
    SQL> SELECT * FROM v$version;
    
    BANNER
    --------------------------------------------------------------------------------
    Oracle Database 11g Enterprise Edition Release 11.2.0.1.0 - 64bit Production
    PL/SQL Release 11.2.0.1.0 - Production
    CORE    11.2.0.1.0      Production
    TNS for Linux: Version 11.2.0.1.0 - Production
    NLSRTL Version 11.2.0.1.0 - Production
    
    SQL> ed
    Wrote file afiedt.buf
    
      1  CREATE TABLE not_partitioned_tbl AS
      2*  SELECT object_id,object_name,created,owner FROM all_objects
    SQL> /
    
    Table created.
    
    SQL> ALTER TABLE not_partitioned_tbl ADD CONSTRAINT not_partitioned_tbl_pk PRIMARY KEY (object_id);
    
    Table altered.
    
    SQL> CREATE INDEX npt_created ON not_partitioned_tbl(created);
    
    Index created.
    
    SQL> EXECUTE DBMS_STATS.gather_table_stats('SCOTT','NOT_PARTITIONED_TBL',cascade=>true);
    
    PL/SQL procedure successfully completed.
    

    Now, I create the staging table without MAXPARTITION, so not all "created" dates cannot be mapped.

    SQL> ed
    Wrote file afiedt.buf
    
      1  CREATE TABLE partitioned_tbl (object_id NUMBER, object_name VARCHAR2(30), created DATE, owner VARCHAR2(30))
      2      PARTITION BY RANGE (created)
      3      (PARTITION pt_2005 VALUES LESS THAN (to_date('01/01/2006','dd/mm/rrrr')),
      4       PARTITION pt_2006 VALUES LESS THAN (to_date('01/01/2007','dd/mm/rrrr')),
      5       PARTITION pt_2007 VALUES LESS THAN (to_date('01/01/2008','dd/mm/rrrr'))
      6      --PARTITION pt_rest VALUES LESS THAN (MAXVALUE) -- Maxpartition  is commented out intentionally.
      7*     )
    SQL> /
    
    Table created.
    
    SQL> EXEC DBMS_REDEFINITION.can_redef_table('SCOTT','NOT_PARTITIONED_TBL');
    
    PL/SQL procedure successfully completed.
    
    SQL> conn sys as sysdba
    Enter password:
    Connected.
    SQL> ed
    Wrote file afiedt.buf
    
      1  BEGIN
      2     DBMS_REDEFINITION.start_redef_table('SCOTT','NOT_PARTITIONED_TBL','PARTITIONED_TBL');
      3* END;
    SQL> /
    BEGIN
    *
    ERROR at line 1:
    ORA-12008: error in materialized view refresh path
    ORA-14400: inserted partition key does not map to any partition
    ORA-06512: at "SYS.DBMS_REDEFINITION", line 52
    ORA-06512: at "SYS.DBMS_REDEFINITION", line 1646
    ORA-06512: at line 2
    
    SQL>
    
  • Error offline - we are sorry, but there was a communication error with the server. Please try again and if the problem persists, contact Adobe Techincal Suport...  (INVALID_QUERY: XMLList object)?

    After a number of years of service, my Adobe Premiere CS4 gives me the following error message:

    Error offline - we are sorry, but there was a communication error with the server. Please try again and if the problem persists, contact Adobe Technical Support...  (INVALID_QUERY: XMLList object).

    I use this software on an old Dell desktop computer to two year with many members and drive.  It is a stand-alone application, not connected to a server.

    Anyone have any ideas on how to solve this problem?

    I think it has to do with the central resource is no longer supported.  Everything works OK if you ignore the message?

  • I'm in photoshop and I'm trying to adjust the pressure of my pen. However, I get this sign of error with the sign of exclamation on the side and the pressure is not resolved.

    I'm in photoshop and I'm trying to adjust the pressure of my pen. However, I get this sign of error with the sign of exclamation on the side and the pressure is not resolved.


    I'm running on Windows 8, I'm using the latest version of Photoshop (2015) and I have a Wacom Intuos tablet. What should I do?

    Thanks, I forgot actually download wacom itself. It works now. Thank you!

  • communication error with the server. callback failed for the data entry page

    Hello

    We have recently applied the corrective update EMP on EMP 11.1.2.0 111.2.1.
    We have following the architecture,

    database server: sql server 2005
    Server Foundation (OS = windows server 2008): HSS, EPMA, Manager Calc, EAS, EIS, provider's server, planning
    Essbase Server (OS = windows server 2008): essbase

    After you apply the patching EMP 11.1.2.1, we apply after Electrodes for IE 9 compactibility i.e EMP 11.1.2.1.600 patches

    1. patch 14119724 (Workspace)
    2 14142678 patch (Shared services)
    3 patch 14224664 (EPMA)
    4 patch 14464109 (planning)

    After you apply above patches, all users get error when opening planning web form through the workspace of all client computer.

    "* error communication with the server. callback failed for the data entry page. "




    When restore us only planning patch 14464109 , issue of "communication error with the server. callback failed for the data entry page "get resolved for all users, but failed for a single user IE"user xyz" "

    the user xyz have OS = windows 7 and IE 8
    user xyz can take foundation server RDP can open any form of planning successfully in vain get when doing the basic machine.

    I have following question:
    1. Why do we get error "error communicating with the server. callback failed for the data entry page"after you apply the fixes to IE9

    2. after cancellation all patches or planning one patch, why the user xyz always get the error but not other users


    Thanks in advance

    Published by: 922755 on June 7, 2013 16:08

    It might be useful to have a read of the following doc Oracle Support - "error:"error Communication with the server. " "Callback failed for the data entry page" when you open a Web form of planning with the members of the Type of text [ID 1392689.1].

    And then this question should be resolved en.600

    See you soon

    John
    http://John-Goodwin.blogspot.com/

  • vCenter 4.1/ESXi 4.1 material status "Communication error with the server.

    I am slot that a brand new installation of vCenter with two new installs of ESXi 4.1 connected on it. I use on Dell PowerEdge 2950 s ESXi servers. I tired the customized version of Dell and vmware ESXi vanilla version. My host vCenter is Windows 2008 R2.

    In vCenter, the two server ESXi, any version of ESXi, I run, I get "Communication error with the server" error when I click the tab hardware state. No data appears in the hardware status tab.

    Only suggestion of Dell has been updated with firmware/BIOS on the server level. I did and it did not help.

    Anyone has any suggestions or ideas what would cause this?

    I had exactly the same problem what is to have everyone on this thread.  I finally called VMware support.  It is certainly a problem with Tomcat.  Apparently, during my initial installation of tomcat server vCenter (on a Win2k8R2 vanilla Server / unreleased) na not create a database file.  The vCenter Server uninstalled eventuall tech and went through the Setup again.  For some reason any Tomcat created db it's good the second time.  After installation, it takes about 5 minutes for the db should be created.

    On Windows 2k8R2 it is located here: C:\Program Files\VMware\Infrastructure\tomcat\lib\xhiveConfig\data

    The name of the comic is VcCache-by default-0. XhiveDatabase.DB

    My server didn't have one at all.  The relocation has created, at the beginning it is 0KB in size.  After 5 minutes, it grows up to 25, 600KB.

    Everything in my vCenter works now correctly.  I'm on 4.1.320137

    I hope this helps.

    Dave

  • Defined column ambiguous error with the Merge statement

    Hi guys,.
    I get the ' Error (136,4): PL/SQL: ORA-00918: column ambiguously defined "error with the following query of fusion,
    MERGE INTO Inv_Stk_Trns_Tail a
       USING (SELECT b.*, c.*
       FROM OLR b ,Inv_Stk_Trns_Tail c 
       WHERE b.Trn_Type <> '0'
         AND b.VoucherType IS NOT NULL
         AND b.VoucherType = 'SF'
         AND b.Item_Code = c.Item_Code
         AND c.PROPERTY = 0) src
       ON (a.Sl_No = src.Sl_No and a.Ref_No = src.Ref_No )
       WHEN MATCHED THEN UPDATE SET Item_Avg_Ppr = src.Opn_Avg_Cost,
                                    Rate_Bc = src.Opn_Avg_Cost;
    I tried to solve the problem in a lot of ways, but no use. Please help me solve this problem. If you want more details, I'll give you.
    Thank you
    RAM

    SELECT B.*, c.

    Try all the (necessary) columns on the code and the name of each column a unique alias.

  • Receives the following in observer logs event error message: error side by side with the event ID 80.

    Original title: SideBySide error

    I have the tracking error in my logs, how can I fix the problem?

    Log name: Application
    Source: SideBySide
    Date: 16/08/2014-04:30:35
    Event ID: 80
    Task category: no
    Level: error
    Keywords: Classic
    User: n/a
    Computer: Problemchild
    Description:
    Activation context generation failed for "C:\Program Files (x 86) \LG Electronics\LG PC Suite\LGPCSuite.exe. Error in manifest or policy file "" online. A component version required by the application conflicts with another version of the component already active. Contradictory elements are: Component 1: C:\Windows\WinSxS\manifests\x86_microsoft.windows.common-controls_6595b64144ccf1df_6.0.7601.17514_none_41e6975e2bd6f2b2.manifest. Component 2: C:\Windows\WinSxS\manifests\amd64_microsoft.windows.common-controls_6595b64144ccf1df_6.0.7601.17514_none_fa396087175ac9ac.manifest.

    The event XML:
    http://schemas.Microsoft.com/win/2004/08/events/event">
     
       
        80
        2
        0
        0 x 80000000000000
       
        49027
        Application
        Problemchild
       
     

     
        C:\Windows\WinSxS\manifests\x86_microsoft.Windows.common-controls_6595b64144ccf1df_6.0.7601.17514_none_41e6975e2bd6f2b2.manifest
        C:\Windows\WinSxS\manifests\amd64_microsoft.Windows.common-controls_6595b64144ccf1df_6.0.7601.17514_none_fa396087175ac9ac.manifest


        C:\Program Files (x 86) \LG Electronics\LG PC Suite\LGPCSuite.exe

    Hello

    Download the latest version of c ++ did not work...

    I have disabled startup items that helped me to solve the problem. I removed the following LG. This suite LG was the origin of the problem. I will never install in the future.

  • vCenter 4 &amp; SQL with authentication Windows - errors in the event log

    I worked on a new installation of SQL 2005 & vCenter 4 and chose to follow the guidelines of good practice and have the configuration of authentication Windows for the DSN and vCenter services.  After a few small problems, I have everything works fine, however there are a lot of Application events generated on SQL Server as follows:

    Event type: Failure Audit

    Event source: MSSQLSERVER

    Event category: (4)

    Event ID: 18456

    Date: 10/20/2009

    Time: 14:17:48

    User: NT AUTHORITY\ANONYMOUS LOGON

    Computer: SQL03

    Description:

    Failed to connect to the user 'NT AUTHORITY\ANONYMOUS LOGON'. CUSTOMER: x.x.x.x

    For more information, see Help and Support Center at http://go.Microsoft.com/fwlink/events.asp .

    Data:

    0000: 18 48 00 00 0e 00 00 00

    0008: 00 00 00 44 00 43 00 0D

    0010: 53 00 56 00 50 00 57 00

    0018: 00 53 00 51 00 4 c 00 4 d

    0020: 30 00 33 00 00 00 07 00

    0028: 00 00 6 D 00 61 00 73 00... m.a.s.

    0030: 74 00 65 00 72 00 00 00 t.e.r...

    It does not appear to pose any real problems, but I don't want my fill with these Application event logs and ideally I want to go to the bottom of him so I know nothings actually bad before it prepares for production.

    I know that this was a mistake that has been received (similar in any case) when you don't have your SQL Server set to mixed authentication & attempted to use SQL to your DSN account, but do not know what it is now.

    Any help appreciated.

    Doug.

    OK - managed to solve my problem by solving another...

    Noticed that graphs of Performance seen in vCenter threw an error - restarted the Management Services Web service on the server vCenter vCenter, solved the graphics Perf error and stopped SQL event logs generated too.

    Doug.

  • Problem with the event and the case of Structure

    Hi all,

    I get the problem in my program, I'm using the two structure one is the same and other structure box.

    In the structure of the case, I had the button as an entry to the SPL and the case structure as the output of the structure of the case.

    And in the same, then I had the two text box (num control A and B) in that I had put the event changes its value. Then, even I put the value has

    num or num B control control control this corrosponding num value will save seeing num C. Now the problem is when I click on

    the theLEB button does not blink until or if you don't put the value of one of the corrosponding num control.i didn't post my file in version 8.5 and 8.6 Please find tha.

    Hello

    It should work like that or I misunderstood what you want to do.

    If Boolean is true, boolean 2 is true, at the same time, you can change the value of A so C or B then C.

    See attachment

Maybe you are looking for

  • Enter the button does not work in the address bar. 28 Firefox

    I have three users on my desktop PC, that is to say me and my wife, and a more. I am running Windows 8.1My firefox works fine, as is the other, but when I switch to the user there is a problemWhen I type a URL, it is www.xxxxxxxxx in the address bar

  • SP64170 cva file

    Hello We tetsing the new 640 G1, but the graphics driver will not be installed through SSM. When I look into the cva file and is the only information in there: < HTML >< meta http-equiv = "Content-Type" content = "text-html; Charset = UTF-8 ">"< HEAD

  • Satellite P10 support WPA2?

    HelloI have a P10 with an Atheros wireless card. The driver is up-to-date with the latest on the Toshiba site. Windows XP SP2. I can not WPA2 AES to work. AES is supported on this configuration? TKIP works of course.

  • ExFAT formatting

    I have a Mac Pro desktop computer with bootcamp Windows and can be a problem if I format my 2nd hard driver with formatting Exfat?

  • VI Analyzer - edit saved config with LabVIEW 8.6.1 problem

    I use VI Analyzer with great success, but have recently switched to LabVIEW 8.6.1.  I am trying to load, edit and save a file previously configured and when I save and run a file CFG 'old', the tests are completely different. Specifically, I'm trying