SSL security certificate; Server error ping while testing the Ping between 2 Windows servers

Hello

I created SelfSSL certificate for a Windows Server to connect to another Windows Server. I have install the certificate using the MMC Console SelfSSL

(Certificates).  When I run an application to test the Ping between 2 Windows servers... The below error is the result of executing that PING test.

Hope someone can enlighten me on a resolution?

Thank you

Try asking in the Windows Server forum:
http://social.technet.Microsoft.com/forums/en-us/category/WindowsServer

Tags: Windows

Similar Questions

  • Windows Explorer has stopped working and needs to close"error message while opening the control panel in Windows 7

    Original title: "Windows Explorer has stopped working and needs to close" Windows 7

    Help, everytime I try to go to the Control Panel, I get the message "Windows Explorer has stopped working and needs to close"


    I searched some other forum posts and can't find anything that works

    I tried using my guest account
    Ran antivirus/spyware
    Disc chk
    scannnow
    shooting and antivirus (under msconfig) programs
    nothing seems abnormal in the printer and device section
    When I look at the errors, which seems to be the culprit: "KERNELBASE.dll, version: 6.1.7601.17651.
    Because of this error, I can't (or don't know how) uninstall programs or doing anything in the control panel.

    I tried to install ms office 2010 when it started past so now I uninstalled all older versions of office and can not install a new because it says I need to uninstall the old version of Groove (not sure that I have never used it).
    I'm not good at this stuff so pls be kind in your explanations of what I should try.

    Thank you!


    Julie
    PS, I have an improved version of Windows 7 and do not know where the drive is.

    Try this:

    1. press CTRL + ALT + DEL
    2. Select the Task Manager
    3. go to: processes > explorer.exe > end process
    4. once go to: Applications > new task > explorer.exe
    See if that helps.
  • Windows live mail send error "the server does not support an SSL connection. Server error 250.

    Original title: Windows live mail error send

    Cannot send mail to Windows Live Mail.  Error message... The server does not support an SSL connection. Server error 250. Server - * address email is removed from the privacy *. Windows Live Mail error ID - 0x800CCC7D. SMTP Protocol.  Port 25.

    It's better, thank you. This message is not from the BT Server; It comes from your Avast antivirus which is intercepting your mail. You would be well advised to turn off the Avast Mail shield; It does not add any additional security if you don't by attention elsewhere, and can cause problems.

    I see that it is the record of mail in bulk that because of the problems in this case. Connect to the Web e-mail account and clear the items junk and deleted records.

    BT is recommended to use SSL, but your original question indicated that SSL was not taken in charge for SMTP on port 25. I think we'd better go on all your settings. Recommendations of BT are on this page: BT email: what are the settings for outgoing and incoming mail servers?, but they only work if you disable Avast scanning mail.

    Right-click on the account name in the folders pane, and then select Properties.

    • Under the servers tab, make sure that my server requires authentication is selected.
      Select connect with authentication in clear text.
    • On the Advanced tab, select this server requires a secure connection (SSL) for both servers.
      Make sure that the incoming (IMAP) port is 993 and port for outgoing (SMTP) is 465.

    When you've made all these changes, close Windows Live mail and wait five minutes for the program do its cleaning and save the modified settings. Then, restart the computer and make sure that the Mail of Avast shield is always off.

    Launch Windows Live Mail, then dial a new test message and send it to yourself. Post a new message in your response.

  • Win Server 2003 SP2. Backup starts and see errror message "error returned while creating the volume shadow copy: 0x8004230f.»

    Win Server 2003 SP2. Backup starts and see errror message "error returned while creating the volume shadow copy: 0x8004230f.» All solutions? CPP, Volume Shadow Copy Stallion are started.

    Thank you for visiting the Microsoft answers community.

    The question you have posted is related to Windows Server and would be better suited in the MS TechNet Windows Server Forum. Please visit this link to find a community that will provide the support you want.

  • Misdiagnosis: an unexpected error occurred while running the test.

    Hello

    We get an error when running the diagnostics of the application.

    An unexpected error occurred while running the test. Please change in developer mode to diagnose the problem.

    When checked the logfile oam... find the error...

    [7:46:6:50, 23/10/12] ORA-01653: unable to extend the JTF table. 16 in the APPS_TS_TX_DATA tablespace JTF_DIAGNOSTIC_LOG

    [7:46:6:50, 23/10/12] Error occurred: Possible reason could be the problem of database
    [7:46:8:807, 10/23/12] oracle.apps.fnd.oam.servlet.ui.util.ICXSessionUtil:... Free WebAppContext. Success! 87001be8b7e98498707a33c28164a8430f84d19173d5fe690c23a04167fb07a7
    [7:46:9:100, 10/23/12] - 2c48bb90:13a885214b3:-7fef
    [7:46:13:825, 10/23/12] oracle.apps.izu.general.diag.RDAACT.runTest (oracle.apps.fnd.oam.diagnostics.exec.ExecutionContext)
    [7:46:13:826, 10/23/12] oracle.apps.izu.general.diag.RDAACT.runTest (oracle.apps.fnd.oam.diagnostics.exec.ExecutionContext)
    [7:46:16:45, 10/23/12] - 2c48bb90:13a885214b3:-7fef
    [7:46:18:761, 10/23/12] oracle.apps.izu.general.diag.RDAACT.runTest (oracle.apps.fnd.oam.diagnostics.exec.ExecutionContext)
    [7:46:18:762, 10/23/12] oracle.apps.izu.general.diag.RDAACT.runTest (oracle.apps.fnd.oam.diagnostics.exec.ExecutionContext)
    [7:46:18:762, 10/23/12] oracle.apps.izu.general.diag.RDAACT.runTest (oracle.apps.fnd.oam.diagnostics.exec.ExecutionContext)

    Please advise...

    Kind regards
    Fahim.

    ORA-01653: unable to extend the JTF table. 16 in the APPS_TS_TX_DATA tablespace JTF_DIAGNOSTIC_LOG

    Seems like tablespace APPS_TS_TX_DATA is saturated, you need to add space.

    Use script below about the space available in each data file:-

    Select substr(df.tablespace_name,1,45) table_space,
    Sum (FS.bytes) free,
    substr(DF.file_name,45) Name_of_File.
    DF.bytes,
    substr (DF. Status, 1, 5) stat
    from dba_data_files df, dba_free_space fs
    where df.tablespace_name = "APPS_TS_TX_DATA."
    Group of substr (df.tablespace_name, 1, 45),
    substr (DF.file_name, 1, 45),
    DF.bytes, substr (DF. Status, 1, 5);

    ALTER DATABASE DATAFILE '' RESIZE 3000 M; - increase the size according to your need and availablitiy.

    Thank you
    JD

  • When you send an e-mail using Outlook Express, I immediately get this message; "Some errors occurred while processing the requested tasks. Please see the list of errors below for more details"

    When you send an e-mail using Outlook Express, I immediately get this message; "Some errors occurred while processing the requested tasks. Please see the list of errors below for more details". Unfortunately, there are no errors listed below and the green bar is frozen on the screen. The message remains in my Outbox and repeated again and again sending. There is absolutely no record and file sent in my sent box. TIA - Ernie

    You have apparent dbx file corruption. A common problem.
     
    Spend most of your messages out of the Inbox and then create new folders to send and sent items box after having moved the messages you want to save to a local folder that you create.
     
    Tools | Options | Maintenance | Store folder will reveal the location of your Outlook Express files. Note the location and navigate on it in Explorer Windows or, copy and paste in start | Run.
     
    In Windows XP, Win2K & Win2K3 the OE user files (DBX and WAB) are by default marked as hidden. To view these files in Windows Explorer, you must enable Show hidden files and folders under start | Control Panel | Folder Options icon | Opinion, or in Windows Explorer. Tools | Folder options | View.
     
    With OE closed, find the DBX files for the items in the Outbox and sent and delete them.  New ones will be created automatically when you open OE.
     
    After you're done, followed by compacting your folders manually while working * off * and do it often.
     
    Click Outlook Express at the top of the the folder tree so no folders are open. Then: File | Work offline (or double-click on work online in the status bar). File | Folder | Compact all folders. Don't touch anything until the compacting is completed.
     
    General precautions for Outlook Express:
     
    Do not archive mail in the receipt or sent items box. Create your own user-defined folders and move messages you want to put in them. Empty the deleted items folder daily. Although the dbx files have a theoretical capacity of 2 GB, I recommend all a 300 MB max for less risk of corruption.
     
    Information on the maximum size of the .dbx files that are used by Outlook Express:
    http://support.Microsoft.com/?kbid=903095
     
    Disable analysis in your e-mail anti-virus program. It is a redundant layer of protection that devours the CPUs, slows down sending and receiving and causes a multitude of problems such as time-outs, account setting changes and has even been responsible for the loss of messages. Your up-to-date A / V program will continue to protect you sufficiently. For more information, see:
    http://www.oehelp.com/OETips.aspx#3 
     
    Why you don't need your anti-virus to scan your email
    http://thundercloud.NET/infoave/tutorials/email-scanning/index.htm
     
    Note that for some AV programs, it may be necessary to uninstall the program and reinstall in custom Mode and uncheck analysis when the option is the result of e-mail messages.
     
    Compact often as specified above.
     
    And backup often.
     
    Outlook Express Quick Backup (OEQB Freeware)
    http://www.oehelp.com/OEBackup/default.aspx 
  • I get an Error Message When you try to send emails. "some errors occurred while processing the requested tasks. Please see the list of errors below for more details". __

    I get an Error Message When you try to send emails. "some errors occurred while processing the requested tasks. Please see the list of errors below for more details".

    But it sends the message anyway... multiple copies, and she also is put in the "Outbox" in Outlook Express as if it is not sent.

    To stop the email to be sent repeatedly to the recipient, I erase it from the "Outbox" but a) you don't know if they really got it) b it is embarrassing for the receiver c) is this a bug I can fix it?

    Thanks for any help.

    You have a corruption of dbx file easily corrected.

    Spend most of your messages out of the Inbox and then create new folders to send and sent items box after having moved the messages you want to save to a local folder that you create.

    Tools | Options | Maintenance | Store folder will reveal the location of your Outlook Express files. Note the location and navigate on it in Explorer Windows or, copy and paste in start | Run.

    In Windows XP, Win2K & Win2K3 the OE user files (DBX and WAB) are by default marked as hidden. To view these files in Windows Explorer, you must enable Show hidden files and folders under start | Control Panel | Folder Options icon | Opinion, or in Windows Explorer. Tools | Folder options | View.

    With OE closed, find the DBX files for the items in the Outbox and sent and delete them.  New ones will be created automatically when you open OE.

    After you're done, followed by compacting your folders manually while working * off * and do it often.

    Click Outlook Express at the top of the the folder tree so no folders are open. Then: File | Work offline (or double-click on work online in the status bar). File | Folder | Compact all folders. Don't touch anything until the compacting is completed.

    General precautions for Outlook Express:

    Do not archive mail in the receipt or sent items box. Create your own user-defined folders and move messages you want to put in them. Empty the deleted items folder daily. Although the dbx files have a theoretical capacity of 2 GB, I recommend all a 300 MB max for less risk of corruption.

    Information on the maximum size of the .dbx files that are used by Outlook Express:
    http://support.Microsoft.com/?kbid=903095

    Disable analysis in your e-mail anti-virus program. It is a redundant layer of protection that devours the CPUs, slows down sending and receiving and causes a multitude of problems such as time-outs, account setting changes and has even been responsible for the loss of messages. Your up-to-date A / V program will continue to protect you sufficiently. For more information, see:
    http://www.oehelp.com/OETips.aspx#3

    Why you don't need your anti-virus to scan your email
    http://thundercloud.NET/infoave/tutorials/email-scanning/index.htm

    Note that for some AV programs, it may be necessary to uninstall the program and reinstall in custom Mode and uncheck analysis when the option is the result of e-mail messages.

    Compact often as specified above.

    And backup often.

    Outlook Express Quick Backup (OEQB Freeware)
    http://www.oehelp.com/OEBackup/default.aspx

    Bruce Hagen
    MS - MVP October 1, 2004 ~ September 30, 2010
    Imperial Beach, CA

  • An error occurred while running the installationCheck for "indesign_install" tool

    When I try and install local versions of CC products that have been provided for me under license by the company that I work, I get an error:

    An error occurred while running the installationCheck for "indesign_install" tool

    Screenshot is below. This is a brand new macbook also (screenshot below), so I don't know why this is happening. Help them to do the work of installation, or as to why this is happening would be appreciated.

    Thank you!

    2016-08-04.png

    Screen Shot 2016-08-04 at 10.17.08.png

    Build.jpg

    Hi Todda,

    I'm not sure people in the download, installation, commissioning forums will be able to offer a solution, given that most of us know better in individual licenses. There are some members of the Adobe staff who jump in, and they may be able to help. If you don't want to wait, however, I would recommend first investigate with the administrator of your business licenses. You can also get help by contacting Adobe customer service.

  • Server error in ' / Application of the vCACReports.

    Hello

    I have a problem with opening vCAC reports Web Site.

    I have installed all the components of the vCAC on single server without any error, vCAC works very well with vSphere connected as an endpoint configuration tasks work as well.

    But when I try to open the Web Site of the component of the activity reports, I get the message:

    Server error in ' / Application of the vCACReports.

    --------------------------------------------------------------------------------

    Input string was not in a correct format.

    Description: An unhandled exception occurred during the execution of the current web request. Please review the stack trace for more information about the error and its origin in the code.

    Exception details: System.FormatException: input string is not in the correct format.

    Source error:

    An unhandled exception is generated during the execution of the current web request. Information regarding the origin and location of the exception can be identified using the exception below stack trace.

    Stack trace:

    [FormatException: input string is not in a correct format.]

    System.Number.ParseSingle (String value, NumberStyles, NumberFormatInfo numfmt options) + 542

    DynamicOps.Web.Reports.ReportEngine.ReportBuilder.parseFont (String fontStr) + 153

    DynamicOps.Web.Reports.ReportEngine.ReportBuilder.getReportStyle (StyleDef style) + 626

    DynamicOps.Web.Reports.ReportEngine.ReportBuilder.InitializeComponent (519)

    DynamicOps.Web.Reports.GetReport.CreateReport (String templateName) + 306

    DynamicOps.Web.Reports.GetReport.Page_Load (Object sender, EventArgs e) + 99

    System.Web.UI.Control.LoadRecursive () + 71

    System.Web.UI.Page.ProcessRequestMain (Boolean includeStagesBeforeAsyncPoint, Boolean includeStagesAfterAsyncPoint) + 3178

    How can I solve this problem?

    Best regards

    Problem solved,

    Regional settings Windows system has been defined for non English-once setting on English vCACReports site works very well.

  • Flex [mobile] iOS app refuses to connect to a self-signed SSL server: error 2032. Ring the bells?

    Hello everyone, thank you for reading this and I hope you could help me with this problem.

    I'll cut to the Chase. I am currently working on a mobile app in Flex for Android and iOS and the app has to get a few HTTP requests and retrieve information from a server, which is currently developing a teammate.

    Everything had to be working very well until we decided a few days before when we have integrated a SSL self-signed certificate in order to make connections more secure, etc.

    On the side of the app, this change, lying just to replace the http with https url and it seems to work perfectly, or that's what we thought.

    Tests on the Simulator or on an Android device worked well, he just showed the warning provided access to a server that had a rogue certificate that could be ignored without any problem. But when we tried to test a Release on a camera of the iPhone version, it would not just work more. A connection every time trying to be established with the server, error 2032 flash is triggered and it fails miserably does not display not warning about certificates not approved at all. For me, it's really confusing that it works on Android devices, but not on the iPhone device.

    I searched on the Web for people having the same problem but I couldn't find an answer to this specific issue of Flex-iOS-Self-signature-SSL. I found this post unanswered questions: http://forums.adobe.com/message/3359072#3359072 but nothing much.

    I tried to create a crossdomain.xml file on the server with guaranteed set to false, and some other stuff to avoid crossdomain policies, but it changed nothing and the problem persists.

    I'm really out of clues, sort of desperate and have no idea how fix it. If anyone knows something related to this problem, please, help me, I'll be less grateful.

    Thank you!

    We decided to buy a verified SSL certificate, and it worked. We can say that the problem is solved, but it wasn't actually because the connection must be established and that the invited user to accept or decline the self-signed certificate, not only do not make the connection.

  • Connection error to the login server to view while adding the view composer

    Hello

    I added VM Vcenter server successfully to the server connection in my opinion. now, I'm trying to add server offline view composer to the login server setting. I get the error message

    Unable to connect to view the composer.

    Thanks in advance for any help

    Hi, could you please download the log files. Check the link mentioned below, it will help you.

    VMware View 5.2 Documentation Library

  • Some error occurred while processing the requested tasks.

    Input server name correct POP3 SMTP Server SMTP port 25 protocol secure (SSL) socket error 11001 error number 0x800CCCOD

    Hello

    Before you help out us, we need of more information about the issue.

    • Exactly when you receive this error message?
    • You receive this error while using any client e-mail like Outlook or Outlook express to access the emails?
    • Since when are you facing this problem?
    • You did changes to the computer before this problem started?

    If you get this error message when accessing the customer to email such as Outlook or Outlook express, you can access the link below and follow the steps described in the article and check if that helps you solve the problem.

    http://support.Microsoft.com/kb/813514

    I hope this helps. Post back with the required information.

    Thank you and best regards,

     

    Srinivas R

    Microsoft technical support.

    Visit our Microsoft answers feedback Forum and let us know what you think.

  • Security certificate is no longer valid after the upgrade to the latest FF.

    I've upgraded to the latest version of FF over the weekend and now I can't access a site that I had been accessing for the following error message:
    An error occurred during a connection to grdpmgr01.dmz.domainname.com:7799.
    The issuer certificate is not valid. (Error code: sec_error_ca_cert_invalid)

    The certificate is self-signed. We have a similar problem with IE that we by-passed.

    You can try setting security.use_mozillapkix_verification to false on the topic: config page as a test to see if it has an impact.

  • An error occurred while troubleshooting the Troubleshooting Wizard cannot continue error 0 x 80040154

    Original title: widows update does not work. Microsoft Fix - It fails with the error 0 x 80040154. What can I do?

    Widows Update does not work.  Microsoft Fix - It fails with the error 0 x 80040154

    The notice reads as follows:

    "Year error occurred while troubleshooting.

    The Troubleshooting Wizard cannot continue

    "error 0 x 80040154."

    I don't have an update since February 28.

    Now, Windows Update and Fix - It don't work.  What can I do?

    Error: 0 x 80040154

    Hello

    1. don't you make changes on the computer before the show?
    2. what update does not work?

    Method 1:
    Perform a clean boot and check if the third-party software are causing the issue of updating.
    How to troubleshoot a problem by performing a clean boot in Windows Vista or in Windows 7
    http://support.Microsoft.com/kb/929135
    Note: After the adventures of shooting set the computer to start as usual by performing step 7 above of the Knowledge Base article.

    Method 2:

    Manually, try to install updates from Microsoft Download Center.
    a. visit the Microsoft Download Web site, type the number of "KB" of the update in the search box and press ENTER.
    b. in the list of search results, click on the (KB) Knowledge Base article link to go to the download page. If there is more than one list, look for a link that goes to the Microsoft Download Center.
    c. If there are several versions on the download page, find the appropriate for your computer. Click on the download button and save the update to your desktop.
    d. When you are prompted, click open to install the update.
    Microsoft Download Center

    Method 3:
    You can try the procedure described in the supplied knowledge base article and check.
    Cannot install updates in Windows Vista, Windows 7, Windows Server 2008 and Windows Server 2008 R2
    http://support.Microsoft.com/kb/2509997
    Note: This section, method, or task contains steps that tell you how to modify the registry. However, serious problems can occur if you modify the registry incorrectly. Therefore, make sure that you proceed with caution. For added protection, back up the registry before you edit it. Then you can restore the registry if a problem occurs. For more information about how to back up and restore the registry, click on the number below to view the article in the Microsoft Knowledge Base. How to back up and restore the registry in Windows:
    http://Windows.Microsoft.com/en-us/Windows7/back-up-the-registry

    Warning: We recommend not to interrupt the CHKDSK process. Microsoft does not guarantee the integrity of the disk if the CHKDSK program is interrupted. For security, you can back up your data before using check disk drive.

  • Error 16 while using the applications in the suite Adobe CC 2015...

    Error 16 while using all the apps in the Adobe CC 2015 suite, it is installed via drive Application Jukebox, I have administrator rights on my laptop and have tried the solutions of permissions on the Adobe support site.

    Completely blocked as to why he suddenly not working.

    1A tried to change permissions on folders of PCD SLstore as intructed.

    2 tried to run with administrator rights.

    3. I tried uninstalling and reinstalling.

    Other help would be great, thanks.

    Error 16 corresponds to the file permission issue and the steps mentioned in the link I provided are useful in some cases.

    In this case, we should try to assign permissions to all of the Adobe directory. Please follow the steps as mentioned below according to your operating system.

    Mac

    1) navigate to the following locations and assign all permissions to the adobe folders to the current user. To navigate, open finder and click on going in the bar on then click goto... type/library/application support of / and then click OK.

    (2) to assign the authorization right click on adobe folder and click on Get info... A window will open. Then click on the lock symbol to allow editing. Then click on sign + to add your user name. Then change read only to read and write. Then click gear icon on the bottom and click on apply to the elements included and click ok...

    Windows

    1) navigate to the following locations and assign all permissions to the adobe folders to the current user.  (Right click on adobe folder select properties then click on the Security tab, click on edit and select current user, that you are connected to, select full control, click on apply and then ok)

    C: / / program data (to view hidden files to see this folder)

    C: / / program files 86 x files / common

    C: / / program files x 86.

    C: / / program files common files

    C: //program files.

    (2) try to run the adobe application

    change to the authorisation should look like image below

Maybe you are looking for

  • Driver for Compaq PC laptop 15-a002tu

    I bought today 'Compaq 15-a002tu Notebook PC' and the search for a driver for this that compatible for Windows7 64 bit. But no where I can find the driver. Please notify.

  • How can I check that B12 is functional?

    Fi project is my service provider. Running MMB29K that takes in charge the band 12. How can this be tested? TIA

  • Limit the decimals

    For some values of less than one my data sheets of often list an appalling number of digits for the measured value. Is there a way to limit the significant digits or the fractional part numbers shown on the card? The preference would be to two digits

  • WPSM54G no reconnect after being turned off printer and turn on again.

    I have a HP Deskjet 2510. It prints well until I have to turn the printer off and got to use it the next time. When I turn it on the USB port on the router is not even the light upward. I have to unplug it and plug it back then it works fine until th

  • Pavilion dv8225nr won't recognize/see SD card,

    As a first step, it would work if I restarted, then used at least very slowly open and see even though he cannot read. Now it does'nt see or give it a drive letter. Tried to use the card with the same results usb reader. Tried reloading the drivers o