1st problem = Error 1606% APPDATA % and 2nd problem = WARNING Logger: initialize() is not yet known. The log file may experience corruption...

1st problem = Error 1606% APPDATA % and 2nd problem = WARNING Logger: initialize() is not yet known. The log file may experience corruption...

Advertisement

Try this FixIt:

Code error '0 x 80070646', '646', or '1606 ' when you try to install Office updates

http://support.Microsoft.com/kb/2258121

André

"A programmer is just a tool that converts the caffeine in code" Deputy CLIP - http://www.winvistaside.de/

Tags: Windows

Similar Questions

  • How can I solve this problem?  Cannot open in Adobe scan because the incorrect file format or corruption

    When I scan a document and try to bring it on my screen in Adobe, I get the error message that it cannot be opened in Adobe because it's in the wrong format or the file is corrupted. How can I fix this problem?

    What format you scan your documents? Adobe Reader opens as pdf files. If you scan to a different image file formats, reader will give you this message.

  • Java Error 1606% AppData % in the update

    I have problems with the new update of java.  This is the Error 1606 %AppData%, but I have tried installing offline also.  It gives me the same error message.  Help, please!  I need access and online class!

    Hi Kclimer

    I just answered you in a different thread

    http://social.answers.Microsoft.com/forums/en-us/VistaInstall/thread/5c0adec0-A782-4C3C-909D-ef2cb66bf0f1

    Ken
    Microsoft Answers Support Engineer
    Visit our Microsoft answers feedback Forum and let us know what you think.

  • It is an intermittent problem, as the excellent files, powerpoint will corrupt network drive.

    It is an intermittent problem, as the excellent files, powerpoint will corrupt network drive. Any help will be much appreciated.

    To avoid this, I'm making sure that files are not left open so much because we run backup incremental three times in a week.

    Files is not very high - about - 2 MB

    Some screenshots are inserted

    Thank you

    Amit

    http://answers.Microsoft.com/en-us/Office/Forum/office_xp-Excel?tab=unanswered&TM=1373425932359

    above is office xp, excel forum you might be better off poster in this forum that many people are familiar with excel and powerpoint.

  • I have a problem with my laptop does not connect to the internet. It connects to our wireless very well, but it doesn't have an internet connection.

    I have a problem with my laptop does not connect to the internet. It connects to our wireless very well, but it doesn't have an internet connection. It connects to other networks wifi very well with Internet access, is that the wireless in my house what it connects to. When I diagnose the problem, it says "Cannot communicate with DNS server (208.67.222.222)", and then under that it says: "languished network diagnostics remote hosts, but had not received a response." It connects to the Internet through an ethernet cable, but it is rather annoying pulling the cable autour. I currently have Windows Vista Home Premium. Thank you!

    original title: Internet connectivity problem

    Hello

    Now, you may need to contact the support of Panda Internet Security centre to change the settings so that wireless is enabled through it.

    Support link: http://www.pandasecurity.com/homeusers/support/

  • Windows xp hp will not start. error message: Windows has not start because the following file is missing or corrupt: < root windows > \system32\hal.dll. Please re - install a copy of the above file.

    Hello, I recently restored my windows hp tower to its factory because of virus settings and when I restarted my PC I recieced this error message: Windows has not start because the following file is missing or corrupt: \system32\hal.dll Please reinstall a copy of the above file.  where can I get a copy? and is it possible to download the start software and burn it to a cd?

    Hi FRANKGRIMES_945,

    What is the model of your computer?

    (a) you can try to arrange for a Windows XP disk that corresponds to the same edition, as it is installed on your machine.

    (b) thereafter, follow this link & check if you are able to start correctly on the desktop.

    Error message: "Windows did not start because of a configuration of the disk of the computer problem.

    Hope the helps of information.
    Please post back and we do know.

  • Error message: Windows has not start because the following file is missing or damaged

    This error sometimes occurs when starting upwards from my Win XP computer:
    Windows could not start because the following file is missing or damaged. Windows root\system32\hal.dll. Please reinstall a copy of the above file.
    the computer then complete the beginning upward and operate normally.

    How can I stop this error message?

    Kind regards

    Hello

    ·         Since when are you facing this problem?

    ·         Remember to make changes to the system?

     

    I suggest to disable the startup items when the system starts up and then check if the problem is resolved.

    How to disable programs that run when you start Windows XP Home Edition or Windows Vista

    http://support.Microsoft.com/kb/270035

    I suggest following the steps mentioned in the article below and check if

    Error message: "Windows did not start because of a configuration of the disk of the computer problem.

    http://support.Microsoft.com/kb/314477

    Thanks and regards.

    Thahaseena M
    Microsoft Answers Support Engineer.

  • I get the following error messages at startup: Windows Sidebar Settings.ini. is used by another system. Recorder warning: recorder! Initialize is not yet call... The log file can corruption exp. application failure did not start.

    Original title: opening of the pop ups

    I have Vista Home version.  When I connect, I get the pop - ups following:

    1.) _Windows sidebar Settings.ini. is used by another system.

    Recorder 2.) WARNING: Logger! Initialize is not yet call... The log file can corruption exp.

    3.) down the application did not start.

    Also: while I'm on the internet a pop - up occurs from time to time indicating: "Internet Explorer has stopped working".  Sometimes I get started, and sometimes I can just 'X' out and I'm always on.

    Hello

    1 how long have you been faced with this problem?
    2 did you recent hardware or software changes to your computer before this problem?

    I suggest you try the procedure below.

    Step 1: Try to perform the clean boot in order to solve startup error messages.

    From your computer by using a minimal set of drivers and startup programs so that you can determine if a background program is interfering with your game or program. This type of boot is known as a "clean boot".

    Follow the steps provide in the article below to perform the clean boot. http://support.Microsoft.com/kb/929135

    Step 2: I suggest you try the steps outlined in the article below to solve the problem of internet Explorer.
    http://support.Microsoft.com/kb/936213

    Thanks and greetings
    Umesh P - Microsoft technical support.

    Visit our Microsoft answers feedback Forum and let us know what you think.
    [If this post can help solve your problem, please click the 'Mark as answer' or 'Useful' at the top of this message.] [Marking a post as answer, or relatively useful, you help others find the answer more quickly.]

  • An error has occurred. Check the log file. C:\User\---\PamperedPartnerPlus\workspace\.metadata\.log

    What should I do: an error has occurred. Check the log file. C:\User\---\PamperedPartnerPlus\workspace\.metadata\.log.

    See this post and follow the instructions to update your program to possibly solve the problem.

    Technical support
    http://www.chefsuccess.com/F46/tech-support-41431/

  • R12.2.5 Installation on OL 7.1 ERROR: RW-50010: error:-script returned an error: 1 RW-50004: error code when you run the external process.  Check the log file for more details

    I tried to install EBS 12.2.5 on OL 7.1 with rapidwiz and got this error when applying the unique patches in second File System

    "Second system logfile file - /app/oracle/TEST/fs2/inst/apps/TEST_ebs122/logs/12021641.log.

    LOG FILE:

    _____________________________________________________________________________________________________________________________

    Step 0-8

    Command: /app/oracle/TEST/fs2/inst/apps/TEST_ebs122/temp/adrunfmw.sh

    Step 4 of 8: UNIX making pretreatment

    Running: chmod 777/db/oracle/OraInventory r

    chmod-r 777/db/oracle/OraInventory succeeded

    Step 4 of 8

    Performance: known appltest - c "/ app/oracle/TEST/fs2/inst/apps/TEST_ebs122/temp/adrunfmw.sh".

    PHASE of INSTALLATION has BEGUN: APPS TECH STACK: Wed Dec 2 17:27:07 IST 2015

    runProcess_1

    StatusString installation of Applications Technology Stack

    Copy the temp area models

    Inventory name is: app_oracle_TEST_fs2_Oracle_EBS_app

    One-time fixes copy to temp area

    Remove JDK_TOP: / app/oracle/TEST/fs2/EBSapps/comn/util/jdk32 if there is

    / App/oracle/TEST/fs2/EBSapps/comn/util/jdk32 deleted directory

    Installation of WebLogic Server.

    With the help of /app/oracle/TEST/fs2/inst/apps/TEST_ebs122/temp/xmldocs/instWLS.xml

    L'exécution de commande : /stageR12/startCD/Disk1/rapidwiz/jre/Linux_x64/1.6.0/bin/java -cp /app/oracle/TEST/fs2/inst/apps/TEST_ebs122/temp/ASInstallHome/fnd /... /j11067592_fnd.zip:/app/Oracle/test/FS2/inst/Apps/TEST_ebs122/Temp/ASInstallHome/FND/Java/3rdparty/stdalone/xmlparserv2.zip-Doracle.apps.fnd.txk.env_home=/app/oracle/TEST/fs2/EBSapps/appl/admin/TEST_ebs122/-Doracle.apps.fnd.txk.runtime.config=/app/oracle/TEST/fs2/inst/apps/TEST_ebs122/temp/xmldocs/instWLS.xml oracle.apps.fnd.txk.config.InstallService

    WebLogic Server successfully installed

    Web Tier utility installation.

    With the help of /app/oracle/TEST/fs2/inst/apps/TEST_ebs122/temp/xmldocs/instWeb.xml

    L'exécution de commande : /stageR12/startCD/Disk1/rapidwiz/jre/Linux_x64/1.6.0/bin/java -cp /app/oracle/TEST/fs2/inst/apps/TEST_ebs122/temp/ASInstallHome/fnd /... /j11067592_fnd.zip:/app/Oracle/test/FS2/inst/Apps/TEST_ebs122/Temp/ASInstallHome/FND/Java/3rdparty/stdalone/xmlparserv2.zip-Doracle.apps.fnd.txk.env_home=/app/oracle/TEST/fs2/EBSapps/appl/admin/TEST_ebs122/-Doracle.apps.fnd.txk.runtime.config=/app/oracle/TEST/fs2/inst/apps/TEST_ebs122/temp/xmldocs/instWeb.xml oracle.apps.fnd.txk.config.InstallService

    Level successfully installed Web utilities

    Registration EBSUsing /app/oracle/TEST/fs2/inst/apps/TEST_ebs122/temp/xmldocs/instEBS.xml

    L'exécution de commande : /stageR12/startCD/Disk1/rapidwiz/jre/Linux_x64/1.6.0/bin/java -cp /app/oracle/TEST/fs2/inst/apps/TEST_ebs122/temp/ASInstallHome/fnd /... /j11067592_fnd.zip:/app/Oracle/test/FS2/inst/Apps/TEST_ebs122/Temp/ASInstallHome/FND/Java/3rdparty/stdalone/xmlparserv2.zip-Doracle.apps.fnd.txk.env_home=/app/oracle/TEST/fs2/EBSapps/appl/admin/TEST_ebs122/-Doracle.apps.fnd.txk.runtime.config=/app/oracle/TEST/fs2/inst/apps/TEST_ebs122/temp/xmldocs/instEBS.xml oracle.apps.fnd.txk.config.InstallService

    EBS registered successfully

    Rename/home/appltest/bea/beahomelist in /home/appltest/bea/beahomelist.29266 to avoid problems during WLS

    patching

    / Home/appltest/Bea/beahomelist renamed successfully.

    Application of ad hoc patches

    With the help of /app/oracle/TEST/fs2/inst/apps/TEST_ebs122/temp/xmldocs/instASpatches.xml

    L'exécution de commande : /stageR12/startCD/Disk1/rapidwiz/jre/Linux_x64/1.6.0/bin/java -cp /app/oracle/TEST/fs2/inst/apps/TEST_ebs122/temp/ASInstallHome/fnd /... /j11067592_fnd.zip:/app/Oracle/test/FS2/inst/Apps/TEST_ebs122/Temp/ASInstallHome/FND/Java/3rdparty/stdalone/xmlparserv2.zip-Doracle.apps.fnd.txk.env_home=/app/oracle/TEST/fs2/EBSapps/appl/admin/TEST_ebs122/-Doracle.apps.fnd.txk.runtime.config=/app/oracle/TEST/fs2/inst/apps/TEST_ebs122/temp/xmldocs/instASpatches.xml oracle.apps.fnd.txk.config.InstallService

    Fatal error: T2K install Service

    oracle.apps.fnd.txk.config.ProcessStateException: OPatch process failed: Output = 1 see log for more details. CMD = perl /app/oracle/TEST/fs2/FMW_Home/webtier/OPatch/opatch.pl apply - verbose - silent - ocmrf /app/oracle/TEST/fs2/inst/apps/TEST_ebs122/temp/ASInstallHome/fnd/admin/template/txkForms_ocm.rsp jdk - / app/oracle/TEST/fs2/FMW_Home/webtier/jdk/app/oracle/TEST/fs2/inst/apps/TEST_ebs122/temp/patches/7695070/7695070

    at oracle.apps.fnd.txk.config.OPatchActionNode.processState(OPatchActionNode.java:312)

    at oracle.apps.fnd.txk.config.PatchActionNode.processState(PatchActionNode.java:187)

    at oracle.apps.fnd.txk.config.PatchNode.processState(PatchNode.java:338)

    at oracle.apps.fnd.txk.config.PatchesNode.processState(PatchesNode.java:79)

    at oracle.apps.fnd.txk.config.InstallNode.processState(InstallNode.java:68)

    at oracle.apps.fnd.txk.config.TXKTopology.traverse(TXKTopology.java:594)

    at oracle.apps.fnd.txk.config.InstallService.doInvoke(InstallService.java:224)

    at oracle.apps.fnd.txk.config.InstallService.invoke(InstallService.java:237)

    at oracle.apps.fnd.txk.config.InstallService.main(InstallService.java:291)

    Can not install the unique patches

    RW-50010: error:-script returned an error: 1

    RW-50004: Error Code when you run the external process.  Check the log file for more details.


    It was recorded in /app/oracle/TEST/fs2/inst/apps/TEST_ebs122/logs/12021641.log and I don't know how to find another newspaper for such details as mentioned in this journal. Please help me with that.


    Concerning

    KasunA

    Found a workaround.  The problem is that, before the 7695070 patch is applied, the installation program backup directory/apps/fs2/FMW_Home/webtier/jdk in /apps/fs2/FMW_Home/webtier/jdk_backup_existing_version, but then it clears. / jdk - the patch fails because it can't find it.  I had to rename the directory of the jdk for jdk2, and as soon as it gets deleted quickly and rename jdk2 jdk.  Then he applies the patches without problem.  A symbolic link would do the same thing.

  • Packer of creative cloud in creating a package that I can install do not.  He goes through the motions, download all updates, create setup file, but it does not work despite the fact that there are no errors in the log files

    Packer of creative cloud in creating a package that I can install do not.  He goes through the motions, download all updates, create setup file, but it does not work despite the fact that there are no errors in the log files

    After hitting my head against the desk to repeatedly create packages, try on different computers I have finally found a solution.

    These packages have been copied on an external drive, if I try and install from the external drive, which is a common practice, it fails.

    If I then copy this file pkg from the outside, to the computer I install, then run it, it will to and moved very well.

    That is mind-boggling stupid, because it's rare that you have to copy the file into any computer, it is less always installed off the coast of externally, and many people in the company are pushing on the network and the management of the suites so there is a serious problem in Adobe package manager if this is the case where it cannot manage the Middle installed offshore.

    I hope that if anyone else is having problems so it suits.

  • Error: Could not open the log file...

    I'm running Fusion 2.0 on an iMac intel with Leopard, and my guest is Vista. Fusion is shared by two users, so I put the package VM in users/shared/Virtual Machines / Vista. The two Admin using Fusion have read/write privileges. When I run Fusion I get this error window:

    Cannot open the log file "/ users/shared/Virtual Machines.localized / Windows Vista.vmwarevm/vmware.log» Check your configuration to ensure that the path specified for the log file is valid and that you have write privileges in this directory. The current log file is always ' /var/folders/R/rIUqaD5FrKi4RkZAfUtGE+++TM/-Tmp-//vmware-name/vmware-name-1414.log'.

    As I am new to VMware Fusion, I'm not sure what this means exactly, maybe that the log file is no longer in its original location? I don't know what is the log file for exactly or how to solve this problem. If someone could point me in the right direction to solve this problem, it would be much appreciated. I tried to search for this topic, but I can't find an account of a similar problem.

    Anyone know what the log file and the importance, in operations? I don't want to something important happening in the future.

    OK, so you use user "tligmohamed", and the record is the property of ' tligmohamed user, then give it the permissions read and write in the same window.

    Also note that things like snapshots and Suspend will NOT work when the sharing between users.  So, whenever you use Windows and plan on using it with another user the next time, you have to make a full "shutdown".

    And again, because the snapshot may not work properly (because the new files are named without the same permissions, you will need to manually adjust all), AutoProtect does not either, so don't forget that AutoProtect is disabled and you are not snapshots.

    This question also can be easily resolved by the start of the user giving the error and then a complete stop the virtual machine, open a session for that user and the other (which gave the error) and try to start it upward.

  • The "Log FIles" in the coldfusion 9.01 administrator access error

    When I try to look at the log files in cfadmin, I get this error:

    Diagnosis:
    The isSystemLog method was not found. He doesn't are has no method with the method specified name and the arguments types or the isSystemLog method is overloaded with argument types ColdFusion cannot decrypt reliably. ColdFusion found 0 methods that correspond to the provided arguments. If it is a Java object and you verified that the method exists, use the javacast function to reduce ambiguity.
    The error occurred on line 283

    I have also noticed that the scheduled tasks 'Last Run' does not update. I enabled logging in cfadmin for scheduled tasks and created a scheduler.log with all the tasks being connected and running properly for this.

    I am at a loss here and really need help before going to live with that.


    The problem has been resolved, it seems that the update applies without error due to the fact that a mail app kept the cfperfmon_9.dll in open C:\windows\system32 which prevented the 9.01 update to crush the original.

    Thank you all for your help! works fine now.

  • FlexBuilder startup error - an error has occurred. Check the log file.

    Hello everyone. It baffles me. When I try to load FlexBuilder, I get a message popup stating the following:

    "An error has occurred. Check the log file
    c:\Program Files\Adobe\Flex Builder 2\configuration\1201413244722.log"

    Note that the file name of the change log. Also note that this file does not exist. I can't find anywhere on my computer. Also note that I am running Vista in 32-bit mode. The error of course is not very descriptive, especially since I don't have the log file. I think that this may be due to a corrupt workspace, but I'm not sure. I've uninstalled and reinstalled the software several times and it will work for awhile, but then he'll come back.

    Any ideas?

    In addition, anyone know of a configuration file that I can change the workspace without loading FlexBuilder? If it is a corrupt workspace I would try to get around it by tapping a different workspace FlexBuilder (I have several).

    Thank you
    Amanda

    Yes, my solution was the same thing. I just run as administrator. After some research it turns out that this is how Microsoft treats problems of incompatibility in Vista. Microsoft actually recommends this:

    1. right click on the executable
    2. Select the "Compatibility" tab
    3. check "run this program as an administrator".

    That's nice, so at least you don't have to manually run the program as administrator, every time that you run the program. Although I find it funny that this is microsofts workaround!

  • R12 rapidwiz error on node2 - AC-00002: error: unable to create the log file

    Over multiple node R12 on Enterprise Linux 4 installation fees. below error is encountered on node2

    AC-00002: error: unable to create the log file
    The installation was successful on the database node and the main node of the Application. On the primary Application node only ' lot

    Treatment services are enabled.

    However, when installing on the application additional node the rapidwiz is errors

    "AC-00002: error: unable to create the log file - $INST_TOP/$CONTEXT_NAME/logs/12202114.log.
    Exception in thread "AWT-EventQueue-0" java.lang.RuntimeException: AC-00002: unable to create the log file.
    $INST_TOP/$CONTEXT_NAME/logs/12202114.log

    I tried to install several times but every time it failed with the same message

    I think that the reason for the failure:

    I am writing on a mounted NFS on Node2. If I access a NFS mount from one server other than of its origin, the root of the application server user is considered person not the user.
    I checked this by pressing a file being logged in as root:

    -rw - r - r - 1 person person 0 20 Dec 10:59 abc

    I mounted node2 successfully using
    Mount-t nfs nas1: / erparch /erparch

    Rapidwiz version is 12.0.0.20

    What are the steps to take in order to proceed with the installation on the second node.

    user10126380 wrote:
    I think that the reason for the failure:

    I am writing on a mounted NFS on Node2. If I access a NFS mount from one server other than of its origin, the root of the application server user is considered person not the user.
    I checked this by pressing a file being logged in as root:

    -rw - r - r - 1 person person 0 20 Dec 10:59 abc

    I think you've correctly identified the source of your problem. By default, the NFS mounts are usually created with the 'root_squash' option, where the user root on a remote system creates its files as the anonymous user ('nobody' in most cases) on the exported NFS volume. It is usually a good practical security; However, in your case, you need to export the NFS volume with no_root_squash to allow the user root on Node2 to create files as expected when you run RapidWiz. Once installation is complete, you should be able to go back to using the default root_squash option, as the following files in the filesystem level of demand will be created by non-root users.

    Your system administrators may not be happy with the idea of an export of no_root_squash, and I wouldn't blame them. :-) If there is dispute, make sure that they understand that it is only for the duration of the installation of the EBS, and she can (and should) be powered once the installation is complete and verified to work.

    These two articles offer a brief explanation of the purpose and value of the NFS mount root_squash/no_root_squash export options.

    Kind regards

    John P.
    http://only4left.jpiwowar.com

    Published by: jpiwowar on December 21, 2009 21:38

Maybe you are looking for

  • Example: HP10bll: HB10ll calculator

    I have problems with my HB10bll calculator, it keeps it sends me wrong answers when I'm working on the current value and future value

  • Report model sheet in

    We're heading TestStand 2012.  In 2010, I changed the sequential model so that after the trial, two reports have been generated.  The two have been the built in text reports but I changed the filter expression while a report was all the results and t

  • Execution does not

    I created a VI (joint) which is supposed to count seconds, minutes and hours when I turn on a Boolean and then delivered value to zero when I turn off the Boolean value. However, my minutes and hours reset when I turn off the Boolean and I don't know

  • My HP PSC 1210 Al lin One xi does not print the small print on a soup Plantation coupon

    My HP PSC 1210 xi all in one printer does not print the small print on a soup Plantation coupon. I was able to print very clearly a letter that I had written and recorded in the notebook. Printing in Notepad is quite small, but it is still much more

  • How can I fix search for windows vista sp2

    original title: repair of search for windows vista sp2 I don't have a problem with my Microsoft updates, but stopped my search on the functions of my office functions. I have Window Vista Home Premium 32-bit with Service Pack 2 installed. How can I f