fatal error on install Weblogic Server installation OEM

I am following the instructions to install Oracle Grid Control 11 GR 1 material of-> http://www.oracle-base.com/articles/11g/GridControl11gR1InstallationOnOEL5.php#java_installation
Step-> Installation of Middleware
Grid Control 11 g Release 1 beams are more middleware components, so we have to install the WebLogic Server before we can proceed with the installation of control Grid. The installation is started with the following command, run as 'oracle '.

When I come to product Installation directories choose - by clicking on the next window gives error "a fatal error has occurred. This application will end'. Please can

The files uncompressed for Weblogic
[oracle@ccoshs02xvoem01 11gr2grid] $ ls - lrt
Total 1096356
drwxr-xr-x 3 oracle oinstall 4096 October 10, 2006 com
-rw - r - r - 1 oracle oinstall 1441 11 January 2007 NOTICE.txt
-rw - r - r - 1 oracle oinstall 11358 11 January 2007 LICENSE.txt
-rw - r - r - 1 oracle oinstall 4891 11 January 2007 CHANGES.txt
drwxr-xr-x channels 3 oracle oinstall 4096 11 January 2007
drwxr-xr-x 4 oracle oinstall 4096 February 19, 2007 Workshop
drwxr-xr-x 4 oracle oinstall 4096 19 February 2007 photos
drwxr-xr-x 3 oracle oinstall 4096 20 March 2007 javax
drwxr-xr-x 12 oracle oinstall 4096 schemaorg_apache_xmlbeans March 20, 2007
drwxr-xr-x 2 oracle oinstall 4096 20 March 2007 repackage
drwxr-xr-x 4 oracle oinstall 4096 20 March 2007 org
-rw - r - r - 1 oracle oinstall 4573 stringsubs.xsd July 8, 2009
-rw - r - r - 1 oracle oinstall 7102 registry.xslt July 8, 2009
drwxr-xr-x 4 oracle oinstall 4096 3 June 2010 wcf
-rw - r - r - 1 oracle oinstall 1752 Dec 17 22:27 wizard.xml
drwxr-xr-x 2 oracle oinstall 4096 Dec 17 22:27 native
-rw - r - r - 1 oracle oinstall 2951 Dec 17 22:27 lpr.xml
-rw - r - r - 1 oracle oinstall 71384 Dec 17 22:27 gpr.xml
-rw - r - r - 1 oracle oinstall 385707 Dec 17 22:27 com.bea.cie.gpr - xbean_3.0.1.0.jar
-rw - r - r - 1 oracle oinstall 462395 Dec 17 22:27 com.bea.cie.gpr - impl_3.0.1.0.jar
drwxr-xr-x 3 oracle oinstall 4096 Dec 17 22:28 sizeinfo
drwxr-xr-x 4 oracle oinstall 4096 Dec 17 archives 22:28
drwxr-xr-x 6 oracle oinstall 4096 Dec 17 22:28 resources
-rw - r - r - 1 oracle oinstall 430344 Dec 17 22:28 installer.jar
drwxr-xr-x 3 oracle oinstall 4096 Dec 17 22:28 META-INF
-rw - r - r - 1 oracle oinstall 1119969142 Jan 28 09:17 wls1034_generic.zip
drwxr-xr-x 4 oracle oinstall 4096 28 Jan 11:22 patch
[oracle@ccoshs02xvoem01 11gr2grid] java of $-jar installer.jar

I downloaded the compressed file wls1034_generic for oracle
http://www.Oracle.com/technetwork/middleware/IAS/downloads/WLS-main-097127.html
Oracle WebLogic Server 11 GR 1 material (10.3.4) + consistency-
Package installer - generic of: file1 1 GB



Please can someone help me with the installation of Oracle Grid Control

You can safely rename the zip file in the container. Apparently, internet Explorer automatically recognizes the type of file inproperly.

Best regards

Maxim

Tags: Database

Similar Questions

  • Fatal error when installing the Server Application Weblogic 11 g (10.3.4)

    Hello

    In the first attempt, I installed a Weblogic 10.3.4 server but when I was deploying an ear, server gets crashed (JDK was crushed) and after that, I was unable to start the server because it gave an error JDK.

    So I uninstalled existing Weblogic server and tried to install the server (same version using the same configuration) once more, but it does not. It asks me for the directory (WLS Home Directory), Complete/Custom and finally the installation, it is down a mistake (when 39% installation is complete) 'fatal error occurred during installation of the file and install it will cleanup now, out! " \Wlserver_10.3\common\bin\consol.exe C:\ < host directory > (access denied)".

    Can someone help me please to solve this error. Thanks in advance

    Kind regards

    Priya

    Hello

    The message that took place there is a permission problem. So could you please try the installation with administrator privileges.

    In case if the same mistakes persist could you try to install another directory C in a different way.

    Kind regards.

    Prakash.

  • There is no company Manager fusion middleware control installed WebLogic Server 12.1.3 (error 404 (not found))

    Hello.

    We have installed WebLogic Server 12.1.3 on Linux x86_64 file fmw_12.1.3.0.0_wls.jar whithout any errors.

    Then load URL handler company fusion middleware control http:// < Host >: 7001/em we received 404 (not found) error

    There are no links, files and dir with EM on the host in/oracle/middleware.

    According to the documentation, it must be installed and worked after you start WebLogic server.

    Please, please help me understand it y it, or how we can install it.

    I think that you need to install FMW Infrastructure (ADF Runtime)

    You can download it from this URL

    Application Development Framework Downloads

    Install FMW Infrastructure on the same folder of weblogic Middleware and then create a new domain with Enterprise Manager option.

  • Fatal error: T2K install Service - Tier Applications

    Hey all.

    I install R12.2.0 on an env several nodes. I can't get past this problem.

    Fatal error: T2K install Service

    oracle.apps.fnd.txk.config.ProcessStateException: OPatch process failed: output = 100 see Journal for more details. CMD = perl /home/apps/VIS/fs2/EBSapps/10.1.2/OPatch/opatch.pl apply - verbose - silent - ocmrf /home/apps/VIS/fs2/inst/apps/VIS_ebstestapp/temp/ASInstallHome/fnd/admin/template/txkForms_ocm.rsp/home/apps/SCREWS/fs2/inst/apps/VIS_ebstestapp/temp/patches/16271876/16271876

    at oracle.apps.fnd.txk.config.OPatchActionNode.processState(OPatchActionNode.java:296)

    at oracle.apps.fnd.txk.config.PatchActionNode.processState(PatchActionNode.java:187)

    at oracle.apps.fnd.txk.config.PatchNode.processState(PatchNode.java:338)

    at oracle.apps.fnd.txk.config.PatchesNode.processState(PatchesNode.java:68)

    at oracle.apps.fnd.txk.config.InstallNode.processState(InstallNode.java:68)

    at oracle.apps.fnd.txk.config.TXKTopology.traverse(TXKTopology.java:594)

    at oracle.apps.fnd.txk.config.InstallService.doInvoke(InstallService.java:224)

    at oracle.apps.fnd.txk.config.InstallService.invoke(InstallService.java:237)

    at oracle.apps.fnd.txk.config.InstallService.main(InstallService.java:291)

    Cannot Patch 10.1 Set.2.

    I make sure that my env is correct and I saw 2 notes Metalink who talks about environmental cleanup and to ensure the right files in the location. To do this. Can someone help me please. I tried to find the right notes so that I can grab the papers, but I don't know what newspapers I need. Any help with honestly appreciated.

    Thank you.

    I have no idea why this work, but this fixed the problem for me:

    Cleaned the tmp folder and installation directory. Then I deleted all the directories created buildstage.sh.

    Unzip the patch startCD o

    New buildstage.sh HS

    Successful installation.

  • Fatal error: T2K install Service cannot patch 10.1.2 tools.

    I'm running an Installation of Vision R12.2 on Oracle Linux 6.5.

    I'm stuck with the error at 46% (adrunfmw.sh) when you set up the reach Texhnology stack.

    Log says ' Can' patch10.1.2 Tools.

    Can you please guide what to do about it?

    Can you please guide what to do about it?

    Fatal error: T2K install Service

    oracle.apps.fnd.txk.config.ProcessStateException: FileSys OS COMMAND Failed: output = 2 see Journal for more details. CMD = make-f ins_forms.mk sharedlib installation # node = NodeId = 1103 Type = TypeName = filesys_patch_action name = RefId = 457 24 State = init ConfigDoc = APPS_C_HOME ParentDoc = null topology = R12 Action = os_cmd

    at oracle.apps.fnd.txk.config.FileSysPatchActionNode.doFileSysOSCmd(FileSysPatchActionNode.java:169)

    at oracle.apps.fnd.txk.config.FileSysPatchActionNode.processState(FileSysPatchActionNode.java:101)

    at oracle.apps.fnd.txk.config.PatchActionNode.processState(PatchActionNode.java:187)

    at oracle.apps.fnd.txk.config.PatchNode.processState(PatchNode.java:338)

    at oracle.apps.fnd.txk.config.PatchesNode.processState(PatchesNode.java:79)

    at oracle.apps.fnd.txk.config.InstallNode.processState(InstallNode.java:68)

    at oracle.apps.fnd.txk.config.TXKTopology.traverse(TXKTopology.java:594)

    at oracle.apps.fnd.txk.config.InstallService.doInvoke(InstallService.java:224)

    at oracle.apps.fnd.txk.config.InstallService.invoke(InstallService.java:237)

    at oracle.apps.fnd.txk.config.InstallService.main(InstallService.java:291)

    Cannot patch 10.1tools. 2.

    RW-50010: error:-script returned an error: 1

    RW-50004: Error Code when you run the external process.  Check the log file for more details.

    APPL_TOP install the driver running for instance SCREWS

    I see this error in the log:

    +++++++++++++++++++++

    /usr/include/GNU/stubs.h:7:27: error: gnu/stubs - 32.h: no such file or directory

    +++++++++++++++++++++

    It's because of missing packets. Please make sure you have the 32 bits of the following RPMS installed as shown in (Oracle E-Business Suite Installation and upgrade 12 Release Notes (12.2) for Linux x 86-64 (Doc ID 1330701.1)).

    libstdc ++-devel *.

    glibc-devel *.

    libaio-devel *.

    Thank you

    Hussein

  • Please help... fatal error T2K install service

    Level DB - SLES11-SP2-x86_64

    Level of APP SLES11-SP2-x86_64

    Our 12.2. installation fails with the following error...

    Fatal error: T2K install Service

    oracle.apps.fnd.txk.config.ProcessStateException: OPatch process failed: output = 100 see Journal for more details. CMD = perl /u02/fs2/EBSapps/10.1.2/OPatch/opatch.pl apply - verbose - silent - ocmrf/u02/fs2/inst/apps/VCP

    D1_dvcpap01/temp/ASInstallHome/FND/admin/template/txkForms_ocm.rsp/u02/fs2/inst/apps/VCPD1_dvcpap01/temp/patches/16271876/16271876

    at oracle.apps.fnd.txk.config.OPatchActionNode.processState(OPatchActionNode.java:296)

    at oracle.apps.fnd.txk.config.PatchActionNode.processState(PatchActionNode.java:187)

    at oracle.apps.fnd.txk.config.PatchNode.processState(PatchNode.java:338)

    at oracle.apps.fnd.txk.config.PatchesNode.processState(PatchesNode.java:79)

    at oracle.apps.fnd.txk.config.InstallNode.processState(InstallNode.java:68)

    at oracle.apps.fnd.txk.config.TXKTopology.traverse(TXKTopology.java:594)

    at oracle.apps.fnd.txk.config.InstallService.doInvoke(InstallService.java:224)

    at oracle.apps.fnd.txk.config.InstallService.invoke(InstallService.java:237)

    at oracle.apps.fnd.txk.config.InstallService.main(InstallService.java:291)

    Cannot Patch 10.1 Set.2.

    RW-50010: error:-script returned an error: 1

    RW-50004: Error Code when you run the external process.  Check the log file for more details.

    APPL_TOP install the driver for the VCPD1 instance running

    Dig the mark file...

    I see these errors... All rpm requirements have been checked and re-checked... but nothing helps...

    See also the references to the /d3/R12/ab/apps/V122XB39/fs1/EBSapps/10.1.2/jdk/jre/lib/i386 in the file below... but our path is /u02/fs2/EBSapps/10.1.2/lib/:/u02/fs2/EBSapps/10.1.2/sysman/lib/

    Thank you

    _________________________________________________________________________________________________________________________________________________________________________________________________

    /U02/FS2/EBSapps/10.1.2/bin/ogcc-M32 o /u02/fs2/EBSapps/10.1.2/sysman/lib/nmupm-L/u02/fs2/EBSapps/10.1.2/lib/-L/u02/fs2/EBSapps/10.1.2/sysman/lib/-L/u02/fs2/EBSapps/10.1.2/lib/stubs/ ' cat u02/fs2/EBSapps/10.1.

    2/lib/sysliblist '-Wl,-rpath,/u02/fs2/EBSapps/10.1.2/lib - lm 'cat /u02/fs2/EBSapps/10.1.2/lib/sysliblist' - ldl-lm-L/u02/fs2/EBSapps/10.1.2/lib-L/u02/fs2/EBSapps/10.1.2/lib/stubs/ /u02/fs2/EBSapps/10.1.2/sysman/l

    IB/s0nmupm.o - lnmupm - lnmemso-L/d3/R12/ab/apps/V122XB39/fs1/EBSapps/10.1.2/jdk/jre/lib/i386/client-L/d3/R12/ab/apps/V122XB39/fs1/EBSapps/10.1.2/jdk/jre/lib/i386 z - lazyload - ljava - ljvm - lverify - z nolazyload - Wl, r

    Path,/U02/FS2/EBSapps/10.1.2/lib/:/U02/FS2/EBSapps/10.1.2/SYSMAN/lib/:/D3/R12/AB/apps/V122XB39/FS1/EBSapps/10.1.2/JDK/JRE/lib/i386/client:/D3/R12/AB/apps/V122XB39/FS1/EBSapps/10.1.2/JDK/JRE/lib/i386 - Wl,--allow-shlib-United Nations

    set - lcore10 'cat /u02/fs2/EBSapps/10.1.2/lib/sysliblist' - ldl - lm

    usr/lib64/GCC/x86_64-SUSE-Linux/4.3/... /... /.. /.. / x86_64-SUSE-Linux/bin/LD: cannot find - ljava

    usr/lib64/GCC/x86_64-SUSE-Linux/4.3/... /... /.. /.. / x86_64-SUSE-Linux/bin/LD: cannot find - ljvm

    usr/lib64/GCC/x86_64-SUSE-Linux/4.3/... /... /.. /.. / x86_64-SUSE-Linux/bin/LD: cannot find lverify.

    collect2: ld returned 1 exit status

    make: * [/ u02/fs2/EBSapps/10.1.2/sysman/lib/nmupm] error 1

    Having failed connecting target nmupm Thu Jun 5 17:16:16 CDT 2014...

    /U02/FS2/EBSapps/10.1.2/SYSMAN/lib

    /U02/FS2/EBSapps/10.1.2/bin/ogcc-M32 o /u02/fs2/EBSapps/10.1.2/sysman/lib/nmus-L/u02/fs2/EBSapps/10.1.2/lib/-L/u02/fs2/EBSapps/10.1.2/sysman/lib/-L/u02/fs2/EBSapps/10.1.2/lib/stubs/ ' cat /u02/fs2/EBSapps/10.1.2

    / lib/sysliblist '-Wl,-rpath,/u02/fs2/EBSapps/10.1.2/lib - lm 'cat /u02/fs2/EBSapps/10.1.2/lib/sysliblist' - ldl-lm-L/u02/fs2/EBSapps/10.1.2/lib-L/u02/fs2/EBSapps/10.1.2/lib/stubs/ /u02/fs2/EBSapps/10.1.2/sysman/li

    b/s0nmus.o /u02/fs2/EBSapps/10.1.2/sysman/lib/libnmus.a 'cat /u02/fs2/EBSapps/10.1.2/lib/sysliblist' - ldl - lm

    MV-f /u02/fs2/EBSapps/10.1.2/bin/nmus /u02/fs2/EBSapps/10.1.2/bin/nmus0

    MV /u02/fs2/EBSapps/10.1.2/sysman/lib/nmus /u02/fs2/EBSapps/10.1.2/bin/

    Completed connecting NMU target Thu Jun 5 17:16:16 CDT 2014...

    /U02/FS2/EBSapps/10.1.2/SYSMAN/lib

    /U02/FS2/EBSapps/10.1.2/bin/ogcc-M32 o /u02/fs2/EBSapps/10.1.2/sysman/lib/nmei-L/u02/fs2/EBSapps/10.1.2/lib/-L/u02/fs2/EBSapps/10.1.2/sysman/lib/-L/u02/fs2/EBSapps/10.1.2/lib/stubs/ ' cat /u02/fs2/EBSapps/10.1.2

    / lib/sysliblist '-Wl,-rpath,/u02/fs2/EBSapps/10.1.2/lib - lm 'cat /u02/fs2/EBSapps/10.1.2/lib/sysliblist' - ldl-lm-L/u02/fs2/EBSapps/10.1.2/lib-L/u02/fs2/EBSapps/10.1.2/lib/stubs/ /u02/fs2/EBSapps/10.1.2/sysman/li

    b//s0nmei.o - lnmei - lnmemso-L/d3/R12/ab/apps/V122XB39/fs1/EBSapps/10.1.2/jdk/jre/lib/i386/client-L/d3/R12/ab/apps/V122XB39/fs1/EBSapps/10.1.2/jdk/jre/lib/i386 z - lazyload - ljava - ljvm - lverify - z nolazyload - Wl, - RPAT

    h,/U02/FS2/EBSapps/10.1.2/lib/:/U02/FS2/EBSapps/10.1.2/SYSMAN/lib/:/D3/R12/AB/apps/V122XB39/FS1/EBSapps/10.1.2/JDK/JRE/lib/i386/client:/D3/R12/AB/apps/V122XB39/FS1/EBSapps/10.1.2/JDK/JRE/lib/i386 - Wl - allow-shlib-undef

    INED - lclntsh-L/u02/fs2/EBSapps/10.1.2/lib-L/u02/fs2/EBSapps/10.1.2/sysman/lib/ - lnmemso-lcore10-Wl,-rpath,/u02/fs2/EBSapps/10.1.2/lib/:/u02/fs2/EBSapps/10.1.2/sysman/lib/:/d3/R12/ab/apps/V122XB39/fs1/EBSapps/10.1

    .2/jdk/jre/lib/i386/client:/D3/R12/AB/Apps/V122XB39/FS1/EBSapps/10.1.2/jdk/jre/lib/i386-L/d3/R12/ab/apps/V122XB39/fs1/EBSapps/10.1.2/jdk/jre/lib/i386/client-L/d3/R12/ab/apps/V122XB39/fs1/EBSapps/10.1.2/jdk/jre/lib/i38

    6 - z lazyload - ljava - ljvm - lverify - z nolazyload-Wl,-rpath,/u02/fs2/EBSapps/10.1.2/lib/:/u02/fs2/EBSapps/10.1.2/sysman/lib/:/d3/R12/ab/apps/V122XB39/fs1/EBSapps/10.1.2/jdk/jre/lib/i386/client:/d3/R12/ab/apps/V122XB39/

    FS1/EBSapps/10.1.2/JDK/JRE/lib/i386 - Wl, - allow-shlib-undefined 'cat /u02/fs2/EBSapps/10.1.2/lib/sysliblist' - ldl - lm

    usr/lib64/GCC/x86_64-SUSE-Linux/4.3/... /... /.. /.. / x86_64-SUSE-Linux/bin/LD: cannot find - ljava

    usr/lib64/GCC/x86_64-SUSE-Linux/4.3/... /... /.. /.. / x86_64-SUSE-Linux/bin/LD: cannot find - ljvm

    usr/lib64/GCC/x86_64-SUSE-Linux/4.3/... /... /.. /.. / x86_64-SUSE-Linux/bin/LD: cannot find lverify.

    usr/lib64/GCC/x86_64-SUSE-Linux/4.3/... /... /.. /.. / x86_64-SUSE-Linux/bin/LD: cannot find - ljava

    usr/lib64/GCC/x86_64-SUSE-Linux/4.3/... /... /.. /.. / x86_64-SUSE-Linux/bin/LD: cannot find - ljvm

    usr/lib64/GCC/x86_64-SUSE-Linux/4.3/... /... /.. /.. / x86_64-SUSE-Linux/bin/LD: cannot find lverify.

    collect2: ld returned 1 exit status

    make: * [/ u02/fs2/EBSapps/10.1.2/sysman/lib/nmei] error 1

    Having failed connecting target MIEC Thu Jun 5 17:16:16 CDT 2014...

    /U02/FS2/EBSapps/10.1.2/SYSMAN/lib

    /U02/FS2/EBSapps/10.1.2/bin/ogcc-M32 o /u02/fs2/EBSapps/10.1.2/sysman/lib/emagtm-L/u02/fs2/EBSapps/10.1.2/lib/-L/u02/fs2/EBSapps/10.1.2/sysman/lib/-L/u02/fs2/EBSapps/10.1.2/lib/stubs/ ' cat /u02/fs2/EBSapps/10.1

    .2/lib/sysliblist '-Wl,-rpath,/u02/fs2/EBSapps/10.1.2/lib - lm 'cat /u02/fs2/EBSapps/10.1.2/lib/sysliblist' - ldl-lm-L/u02/fs2/EBSapps/10.1.2/lib-L/u02/fs2/EBSapps/10.1.2/lib/stubs/ /u02/fs2/EBSapps/10.1.2/sysman/

    lib//s0nmum.o - lnmum - lclntsh-L/u02/fs2/EBSapps/10.1.2/lib-L/u02/fs2/EBSapps/10.1.2/sysman/lib/ - lnmemso-lcore10-Wl,-rpath,/u02/fs2/EBSapps/10.1.2/lib/:/u02/fs2/EBSapps/10.1.2/sysman/lib/:/d3/R12/ab/apps/V122XB39/f

    S1/EBSapps/10.1.2/jdk/jre/lib/i386/client:/D3/R12/AB/Apps/V122XB39/FS1/EBSapps/10.1.2/jdk/jre/lib/i386-L/d3/R12/ab/apps/V122XB39/fs1/EBSapps/10.1.2/jdk/jre/lib/i386/client-L/d3/R12/ab/apps/V122XB39/fs1/EBSapps/10.1.2/

    jdk/jre/lib/i386 - z lazyload - ljava - ljvm - lverify - z nolazyload-Wl,-rpath,/u02/fs2/EBSapps/10.1.2/lib/:/u02/fs2/EBSapps/10.1.2/sysman/lib/:/d3/R12/ab/apps/V122XB39/fs1/EBSapps/10.1.2/jdk/jre/lib/i386/client:/d3/R12/ab

    /Apps/V122XB39/FS1/EBSapps/10.1.2/JDK/JRE/lib/i386 - Wl, - allow-shlib-undefined 'cat /u02/fs2/EBSapps/10.1.2/lib/sysliblist' - ldl - lm

    usr/lib64/GCC/x86_64-SUSE-Linux/4.3/... /... /.. /.. / x86_64-SUSE-Linux/bin/LD: cannot find - ljava

    usr/lib64/GCC/x86_64-SUSE-Linux/4.3/... /... /.. /.. / x86_64-SUSE-Linux/bin/LD: cannot find - ljvm

    usr/lib64/GCC/x86_64-SUSE-Linux/4.3/... /... /.. /.. / x86_64-SUSE-Linux/bin/LD: cannot find lverify.

    collect2: ld returned 1 exit status

    make: * [/ u02/fs2/EBSapps/10.1.2/sysman/lib/emagtm] error 1

    Having failed connecting target emagtm Thu Jun 5 17:16:16 CDT 2014...

    /U02/FS2/EBSapps/10.1.2/SYSMAN/lib

    /U02/FS2/EBSapps/10.1.2/bin/ogcc-M32 o /u02/fs2/EBSapps/10.1.2/sysman/lib/nmocat-L/u02/fs2/EBSapps/10.1.2/lib/-L/u02/fs2/EBSapps/10.1.2/sysman/lib/-L/u02/fs2/EBSapps/10.1.2/lib/stubs/ ' cat /u02/fs2/EBSapps/10.1

    .2/lib/sysliblist '-Wl,-rpath,/u02/fs2/EBSapps/10.1.2/lib - lm 'cat /u02/fs2/EBSapps/10.1.2/lib/sysliblist' - ldl-lm-L/u02/fs2/EBSapps/10.1.2/lib-L/u02/fs2/EBSapps/10.1.2/lib/stubs/ /u02/fs2/EBSapps/10.1.2/sysman/

    lib/s0nmocat.o - lnmocat - lcrypt-L/u02/fs2/EBSapps/10.1.2/lib-L/u02/fs2/EBSapps/10.1.2/sysman/lib/ - lnmemso-lcore10-Wl,-rpath,/u02/fs2/EBSapps/10.1.2/lib/:/u02/fs2/EBSapps/10.1.2/sysman/lib/:/d3/R12/ab/apps/V122XB39

    /FS1/EBSapps/10.1.2/jdk/jre/lib/i386/client:/D3/R12/AB/Apps/V122XB39/FS1/EBSapps/10.1.2/jdk/jre/lib/i386-L/d3/R12/ab/apps/V122XB39/fs1/EBSapps/10.1.2/jdk/jre/lib/i386/client-L/d3/R12/ab/apps/V122XB39/fs1/EBSapps/10.1.

    2/jdk/jre/lib/i386 - z lazyload - ljava - ljvm - lverify - z nolazyload-Wl,-rpath,/u02/fs2/EBSapps/10.1.2/lib/:/u02/fs2/EBSapps/10.1.2/sysman/lib/:/d3/R12/ab/apps/V122XB39/fs1/EBSapps/10.1.2/jdk/jre/lib/i386/client:/d3/R12/

    ab/apps/V122XB39/fs1/EBSapps/10.1.2/jdk/jre/lib/i386 - Wl, - allow-shlib-undefined 'cat /u02/fs2/EBSapps/10.1.2/lib/sysliblist' - ldl - lm

    usr/lib64/GCC/x86_64-SUSE-Linux/4.3/... /... /.. /.. / x86_64-SUSE-Linux/bin/LD: cannot find - ljava

    usr/lib64/GCC/x86_64-SUSE-Linux/4.3/... /... /.. /.. / x86_64-SUSE-Linux/bin/LD: cannot find - ljvm

    usr/lib64/GCC/x86_64-SUSE-Linux/4.3/... /... /.. /.. / x86_64-SUSE-Linux/bin/LD: cannot find lverify.

    collect2: ld returned 1 exit status

    make: * [/ u02/fs2/EBSapps/10.1.2/sysman/lib/nmocat] error 1

    Having failed connecting target nmocat Thu Jun 5 17:16:16 CDT 2014...

    Have you followed all the steps to the pre - req. (Oracle E-Business Suite Installation and upgrade 12 Release Notes (12.2) for Linux x 86-64 (Doc ID 1330701.1))?

    Thank you

    Hussein

  • Fatal error when installing Parallels

    Sorry if this question has been answered, but I can't seem to find it anywhere.

    I try to install the Circuit Design Suite 11.0 on my Mac using Parallels (Windows 7).  Whenever I try to run the Setup file, it starts, but also gives me an error that reads:

    "Fatal error!"  The required NIPathsDir CDS110DIR property is not set.

    I can't take this step and tried Googling that everything about nothing doesn't.  If anyone has multisim under Parallels, could give you an idea?

    I thank you and let me know if you need any additional information from me.

    I found the solution to this problem, in case anyone else has this problem in the future.  It seems that the problem was that I was sharing my files to Mac OS X with windows.  Apparently, if the folders inside your windows target a network folder, there are problems with the installation of multisim.  The solution is as follows: click the parallel red button in the top right of the screen, go to devices, sharing and then uncheck the "Mac OS X with Windows sharing folders.  Worked like a charm after that.

  • Fatal error when installing the Photosmart all-in-one software on Windows 7 x 64 for printer C4385

    Hello

    I had to reformat one of my laptops and as a result, reinstall the Photosmart software & drivers for my printer C4385. I downloaded the software from the HP website (http://h10025.www1.hp.com/ewfrf/wc/softwareDownloadIndex?softwareitem=mp-76047-2&cc=us&dlc=en&lc=en&... =).

    However, during the installation, I get on a fatal error in the last step, "product Configuration".  I uninstalled and reinstalled several times with the same result.  As you can imagine, I am really frustrated and seeks help from the community to solve this problem.  Here is a screenshot of the error.  Your help in solving this problem is greatly appreciated.

    Hello

    I see that you have a problem with the printer.

    I suggest you to install the software one. Go ahead and uninstall the software first and then follow the instructions below.

    You should get to a point in the facility, which looks something like this. Please click on the area where the yellow arrow.

    Once you do, it will look like this. Please install each driver one by one, starting with the first options which is the printer driver. You have to disable each option, that some of these drivers will not let you uncheck which is very good.

    Once its finish, you can go back and do the following installation.

    Let me know the results.

  • Fatal error C6380 install on Windows 7 32-bit

    As the title suggests, HP C6380 AIO install the software on a laptop HP with Windows 7 32 bit. First, the closed disc had only driver for XP/Vista and Mac package. I helped the owner by telephone with the installation in a first time. He has inserted the disk and started installing program. Gets through extraction, spash HP install and starts actual installation by checking the system and install then real begins. Almost immediately, he gets a fatal error showing the folder Data/Local/Temp/xxxxx of user/Application as the location of the error. Through a process of checking online for the solution. Said the solution found and loaded on the desktop. Completed unsuccessful installation uninstalls and asking to reboot.

    To restart, I run the solution file. No really help. I have the printer set up on its wireless network and checked that it is there and works. The problem seems to be with the software package and the installation on Windows 7. I downloaded the package in 32-bit Windows 7 and tried to run to settle. I get the same fatal error after unpacking and checking system. Same spot, same error message.

    The user is configured as an administrator account.

    I have a right-click the software downloaded and run as administrator.

    Also checked and resolved any issue of property to the admin user.

    I tried to download and run the XP/Vista package, but it does not, claiming that it is not for Windows 7.

    I WAS able to install the new printer in the printers from Windows 7 folder. He recognized and installed the C6380. Print test page with success. All right. But we cannot use all the features and options without the bundled software. I need a solution to get this loaded software.

    Thank you

    Dave

    I found a fix for the problem so I thought I would post it here. I did go to the printers & Devices folder and do a printer installation. I leave install and search for Windows 7. After the installation is complete, I restarted the AIO software and it went flawlessly. I have now all features.

    Good luck to all.

    Dave

  • Fatal error C000021a 0xC0000354 after the installation of security updates, October 12, 2010

    I installed the updates of windows on October 12, 2010 and also improved the adobe acobate security update security this week.  Got a fatal error code I listed above... when I reboot the screen was frozen... loved this blue screen... now what... microsoft help me with this one?

    Hello
     
    I suggest you try the steps in the article.
    http://support.Microsoft.com/kb/156669

    Thanks and greetings
    Umesh P - Microsoft technical support.

    Visit our Microsoft answers feedback Forum and let us know what you think.
    [If this post can help solve your problem, please click the 'Mark as answer' or 'Useful' at the top of this message.] [Marking a post as answer, or relatively useful, you help others find the answer more quickly.]

  • Getting error when installing VC Server 5.1

    Hello

    I am trying to install VC Server 5.1 inside the VM Ware 9 workstation, but get error like not processor support. (Attached screenshot for reference to screen).

    Is someone can you please tell me why I get this error when I installed other components such as Esxi 5.1, VC Client successfully.

    My host config are:

    Processor: Core i7 3rd Gen

    RAM; 16GB

    And I use Win Server 2008 Data Center inside the workstation to install VC Server 5.1

    Thank you

    Ashish

    If you have a processor 64-bit with VT support, you should be able to run 64 but the guest operating system

    http://KB.VMware.com/selfservice/microsites/search.do?language=en_US&cmd=displayKC&externalID=1003945

  • get the error when starting weblogic server in jdeveloper

    get an error when you start weblogic server in jdeveloper

    The NEWSPAPER (its sequel shows):

    < 25 July 2013 19:19:15 IST > < opinion > < WebLogicServer > < BEA-000331 > < started WebLogic Admin Server "DefaultServer" domain "DefaultDomain" running in development Mode >

    < 25 July 2013 19:19:15 IST > < opinion > < WebLogicServer > < BEA-000365 > < Server State has changed in the RACE >

    < 25 July 2013 19:19:15 IST > < opinion > < WebLogicServer > < BEA-000360 > < server started operation >

    The user ' directors [weblogic, directors] =' the role of the administration. All jobs by administrators must go through an Administration Port.

    Authentication failure connecting to the IntegratedWebLogicServer application server. Please check the settings.

    Cannot complete the commissioning of the IntegratedWebLogicServer application server.

    [IntegratedWebLogicServer Instance server stops.  All running applications will be terminated and canceled.]

    [End of forcing of IntegratedWebLogicServer]

    Taskkill /F/PID 1620

    Process is complete.

    PLs help me

    User, please tell us your jdev version!

    Somehow your credentials are corrupted. Two possible solution:

    (1) open your folder, system11.1.1.xxxx open the DefaultDomain\servers\DefaultServer\security folder and edit the boot.properties file. Delete the part '(AES)... ". «"after the username and password and write the new example of username = weblogic", password = "Welcome1" Save the file and try to restart the integrated server. Once the server starts the entries are encoded again.

    (2) If 1) doesn't work, remove all of the DefaultDomain file and create a new instance of WLS in jdev.

    Timo

  • fatal error when installing master collection '[FATAL] installation - installation package error C:\Users\Desktop\MasterCollection_CS6_LS6\packages\core\PDApp.pimx. Returns the value of pim_installPackage = - 1

    Hello

    When I try to install a trial like photoshop cs6 or master collection cs6 product, I get the error "Installer has not initialized. I used Adobe cleaner to remove all products cs6 and tried again, but no luck, same error.

    I opened the log file and find this line:

    [FATAL] Setup error - installation package C:\Users\moshe-a\Desktop\MasterCollection_CS6_LS6\packages\core\PDApp.pimx.

    Returns the value of pim_installPackage = - 1

    No idea how to fix?

    Thank you, Momu

    start at the top and work your way down to apply applicable patches until your problem is solved.

    If (win) cc: https://helpx.adobe.com/creative-cloud/kb/creative-cloud-desktop-application-failed.html

    If your error is:

    "Setup failed to initialize. File not found. ' or 'could not initialize installation. This could be due to missing files.

    first of all, rename folder OOBE OOBE.old.

    to find the OOBE:

    Win 64 bit OS: Program Files x86\Common Files\Adobe\OOBE

    Win 32 bit OS: Program Files \Common Files\Adobe\OOBE

    Mac os: HD > library > application support of > adobe > caps

    Mac os: USER > library > application support of > adobe > OOB

    If it fails or isn't the exact error you see, uninstall, clean (http://www.adobe.com/support/contact/cscleanertool.html) and reinstall.

    If you use an installation dvd:

    Copy the contents of the drive in a desktop folder and install from this directory.

    If you are using a mac:

    1. try to create a new user account in Mac with administrator privileges.

    2. connect to the new user, navigate to Mac HD > Application > utilities > Adobe Installer folder, locate products such as Adobe Reader, Adobe Flash, Adobe Air and uninstall the

    3. navigate to the user library > Application Support > Adobe and Adobe put in the trash.

    4. navigate to Mac HD > library > Application Support > Adobe and Adobe put in the trash.

    5 restart the installation.

    If everything is applicable above fails, check your Setup logs:

    http://helpx.Adobe.com/Photoshop-elements/KB/troubleshoot-install-using-logs-elements.html

  • Error when installing windows server 2012 R2

    Hi all, I tried to install windows 2012 r2 server using a usb key. Everything goes normally, but once installation is complete, I get an error "failed to connect wire". Please. help me guys

    Thank you!

    Please post your query to:

    https://social.technet.Microsoft.com/forums/WindowsServer/en-us/home?category=WindowsServer

    Server issues are better addressed there. Select a category more appropriate from the left.

  • How can I fix msi.dot4wrp01 fatal error when installing HP printer

    try to install the missing components that I never installed with my HP 4500 all-in-One Printer G510-g.  I use windows XP Pro on a Dell D620 latitiude with two Centrino processors.

    Tried to fix with Hp Support 4 times and with Microsoft Fix - It.  I need to install the components of the Analyzer.  I have been feeling jhav and copy of several months. Choose analyze now (nee dto laod of digital imaging software).

    HP guard uninstall my printer after he realizes that the drivers for the printer are uptodate more that what it is trying to install, but then the printer will not work. I used the HP CD 4 times and download of the site twice more windows fixit for printer - in vain.

    Utility HP tells me every time to check and install Windows updates. I tried.  Fix - it tells me that he fixed the Windows Update components.  They are not repaired Windows Update still does not. There are 3 essential updates that Windows did not install: .net framework 1.1, 2 Sp 2 and 3.5 Sp3 (kb 951847, Ko 2698023, 2729450 KB)

    have restaretd a lot of time.  Printer unplugged, reset, etc.  All to nothing does not.

    Transfer your question in the Windows Update forum with the subject "cannot install KB2729450, KB951847, KB2698023".

    Do right click my computer and select properties to see which service pack you have and don't forget to include this information in your new question, as well as Windows Update error codes.

    Or see the 14 November 2012, PA response wear here: http://answers.microsoft.com/en-us/windows/forum/windows_xp-windows_update/kb2698023-failed-to-install-error-code-0x643/835c4180-fe90-48a3-af44-9363806480dd

Maybe you are looking for

  • Iphone6 + gel

    I've updated yesterday at 10 and immediately problems - my imessage/remove /emails facebook offer any published text freeze if I use two times higher (e.g. a typing error) or if I completely random use of words for example buttie! absolutely no probl

  • Compacting files: I get the message, "not enough disk space.

    Compaction stops, a message on "not enough disk space. I tried to delete the .msf file and also delete "inbox." Nothing works.

  • several tasks in multi threads

    I have an application that must be able to go out and capture of several materials OR simultaneously. I coded it so that each task nidaq contains only the ports of capture for a single device or output ports for one device. That is, if I use two DevA

  • Seems one of the MS three a virus updates, KB2467173, ATI Driver, or Brother printer driver

    automatic update for VISTA activated, had virus after update message has been installed: remove virus, ms auto update installed update again. new virus; Yet once I deleted viruses: now turned automatic update of MS: no viruses, but the last update ar

  • BlackBerry Device classic incorrect password

    I keep trying to install BBB and Device Manager - every time I asks me to enter my device password... one that I have no problem whatsoever entered to unlock my phone... it tells me that I entered a wrong password.  What the devil?