Reviews for .dll file loading error when starting the laptop

After removing an infection from malware Thinkpoint of my laptop and reconstituted at almost normal speed, a notice of a .dll file loading error appears while booting.  What are the options to eliminate that?

Advertisement

This isn't a lot of information to go, but it's because forums MS Answers does not prompt for information, when a new question is asked.

Thank you MS Answers, allowing the resolution of simple problems as frustrating and a lot of time as possible.

Read this and see if it looks like your question and if it is not, let us know exactly what you see and we will always fix it:

Here are the detailed instructions that protect you and solve your problem in the 'right' way.

If you do not have a good explanation for the name of the file in a Google search, the chances are good that your system is currently or has been infected by malware.

A "Cannot find...". ', ' Failed to start..., "Could not load..." ». "Might not work... "" Cannot run ""error loading... ". "or"specific module could not be found"message at startup is usually related to the malware that has been configured to run at startup, but the referenced file has been removed after a malware scan, leaving behind him a startup item or the registry entry pointing to a file that does not exist.
It might be a removal of malicious software or an application not installed.  The entry may have a curious looking name since it was probably generated at random when the malware was installed. If you search your system for the referenced file, you may not find.
Windows attempts to load this file but cannot locate because the file has been deleted for most probably during an analysis of the malware. However, an orphaned associate of remainders of startup parameter or registry entry and tells Windows to load the file when you start or connection.
So you should delete the referenced entry Windows stop trying to load or run the file. It may or may not be included in the registry, but you can find it.  Autoruns (see below) you get the elements no matter where it is.

You must be sure to solve the problem and not just fix the symptom of the problem by simply relieving your message - system is not a fix (there is a difference).

If you just locate and uncheck the item in msconfig, which disables the element but does not remove the reference to the element of false starting your computer.   The msconfig program is not a Startup Manager, that's a troubleshooting tool.  Disabling things in msconfig to put an end to the messages and think that your problem is solved is short-sighted and leave behind him a sloppy XP configuration.  Just disable the display of a start-up error message should not count as a 'solution' to the problem.
If you are comfortable editing the registry, you can find and remove the reference directly from there or remove it using a popular third-party tool called Autoruns.  The problem can always be found in the registry well.
Before making any changes to your registry by hand or with third-party tools, don't forget to first make a backup of the registry. There is no cancellation or exit without saving the option in regedit.
Here is a link to a popular registry backup tool:
You can also use the Autoruns to find the element of start remains little matter where he's hiding.  Autoruns does not install anything on your computer.  It will display all startup locations where the reference may be then you can turn it off or remove it completely.  Here is the download link for Autoruns:
Run Autoruns.exe and wait that he at the end of the filling of the list of entries.
When the Autoruns is finished scanning your system, it will say "Ready" in the lower left corner.  Autoruns can be a little intimidating to first if you have never seen it before because it displays a lot of information
.  You are really interested only a few sections.
The problem is usually to start the system or the user startup entries, then click the connection tab and see if the startup item is there.
Scroll through the list and look for a boot entry associated files in the error message.
If you can't find on the connection tab, look in any tab.
You can also click file, search to search for logon, or any tab for all or part of the name of the element.
Right-click on the offending entry and choose Remove.  If you are not sure what it is, you can simply disable, restart and if the problem is resolved and then remove the offending entry.  If you don't see it in Autoruns, you may edit the registry and remove the item from your startup folder it.  Autoruns shall display the same information however.
Given that your system has or has had an infection, follow up with this:
Perform scans for malware, and then fix any problems:
Download, install, update and do a full scan with these free malware detection programs:
Malwarebytes (MMFA): http://malwarebytes.org/
SUPERAntiSpyware: (SAS): http://www.superantispyware.com/
They can be uninstalled later if you wish.
Restart your computer and solve the outstanding issues.

Tags: Windows

Similar Questions

  • Error when starting the weblogic Server

    Hi all

    I get the following error when starting the weblogic server (10.3.5.0). I couldn't access the EM.

    < 9 July 2012 19:00:23 IST > < error > < org.apache.beehive.netui.pageflow.internal.AdapterManager > < BEA-000000 > < ServletContainerAdapter manager not initialized successfully. >

    java.lang.NoClassDefFoundError: HTTPClient/ProtocolNotSuppException

    at oracle.sysman.eml.app.EMDClientInitializer.setHttpConnectionTimeout(EMDClientInitializer.java:97)

    at oracle.sysman.eml.app.EMDClientInitializer.init(EMDClientInitializer.java:85)

    at oracle.sysman.emSDK.svc.ServiceUtil.initService(ServiceUtil.java:94)

    at oracle.sysman.eml.app.ContextInitializer.contextInitialized(ContextInitializer.java:432)

    to weblogic.servlet.internal.EventsManager$ FireContextListenerAction.run (EventsManager.java:481)

    at weblogic.security.acl.internal.AuthenticatedSubject.doAs(AuthenticatedSubject.java:321)

    at weblogic.security.service.SecurityManager.runAs(SecurityManager.java:120)

    at weblogic.servlet.internal.EventsManager.notifyContextCreatedEvent(EventsManager.java:181)

    at weblogic.servlet.internal.WebAppServletContext.preloadResources(WebAppServletContext.java:1872)

    at weblogic.servlet.internal.WebAppServletContext.start(WebAppServletContext.java:3153)

    at weblogic.servlet.internal.WebAppModule.startContexts(WebAppModule.java:1508)

    at weblogic.servlet.internal.WebAppModule.start(WebAppModule.java:482)

    to weblogic.application.internal.flow.ModuleStateDriver$ 3.next(ModuleStateDriver.java:425)

    at weblogic.application.utils.StateMachineDriver.nextState(StateMachineDriver.java:52)

    at weblogic.application.internal.flow.ModuleStateDriver.start(ModuleStateDriver.java:119)

    at weblogic.application.internal.flow.ScopedModuleDriver.start(ScopedModuleDriver.java:200)

    at weblogic.application.internal.flow.ModuleListenerInvoker.start(ModuleListenerInvoker.java:247)

    to weblogic.application.internal.flow.ModuleStateDriver$ 3.next(ModuleStateDriver.java:425)

    at weblogic.application.utils.StateMachineDriver.nextState(StateMachineDriver.java:52)

    at weblogic.application.internal.BaseDeployment.activate(BaseDeployment.java:205)

    at weblogic.application.internal.EarDeployment.activate(EarDeployment.java:58)

    at weblogic.application.internal.DeploymentStateChecker.activate(DeploymentStateChecker.java:161)

    at weblogic.deploy.internal.targetserver.AppContainerInvoker.activate(AppContainerInvoker.java:79)

    at weblogic.deploy.internal.targetserver.BasicDeployment.activate(BasicDeployment.java:184)

    at weblogic.deploy.internal.targetserver.BasicDeployment.activateFromServerLifecycle(BasicDeployment.java:361)

    to weblogic.management.deploy.internal.DeploymentAdapter$ 1.doActivate(DeploymentAdapter.java:51)

    at weblogic.management.deploy.internal.DeploymentAdapter.activate(DeploymentAdapter.java:200)

    to weblogic.management.deploy.internal.AppTransition$ 2.transitionApp(AppTransition.java:30)

    at weblogic.management.deploy.internal.ConfiguredDeployments.transitionApps(ConfiguredDeployments.java:240)

    at weblogic.management.deploy.internal.ConfiguredDeployments.activate(ConfiguredDeployments.java:169)

    at weblogic.management.deploy.internal.ConfiguredDeployments.deploy(ConfiguredDeployments.java:123)

    at weblogic.management.deploy.internal.DeploymentServerService.resume(DeploymentServerService.java:180)

    at weblogic.management.deploy.internal.DeploymentServerService.start(DeploymentServerService.java:96)

    at weblogic.t3.srvr.SubsystemRequest.run(SubsystemRequest.java:64)

    at weblogic.work.ExecuteThread.execute(ExecuteThread.java:209)

    at weblogic.work.ExecuteThread.run(ExecuteThread.java:178)

    Caused by: java.lang.ClassNotFoundException: HTTPClient.ProtocolNotSuppException

    at weblogic.utils.classloaders.GenericClassLoader.findLocalClass(GenericClassLoader.java:297)

    at weblogic.utils.classloaders.GenericClassLoader.findClass(GenericClassLoader.java:270)

    at weblogic.utils.classloaders.ChangeAwareClassLoader.findClass(ChangeAwareClassLoader.java:64)

    at java.lang.ClassLoader.loadClass(ClassLoader.java:306)

    at java.lang.ClassLoader.loadClass(ClassLoader.java:247)

    at weblogic.utils.classloaders.GenericClassLoader.loadClass(GenericClassLoader.java:179)

    at weblogic.utils.classloaders.ChangeAwareClassLoader.loadClass(ChangeAwareClassLoader.java:43)

    ... more than 40

    PostInstallConfigIntegration:oracle_ias_farm target auth check is performed.

    < 9 July 2012 19:00:49 IST > < WARNING > < HTTP > < BEA-101162 > < oracle.sysman.eml.app.ContextInitializer listener has not defined by user: java.lang.NoClassDefFoundError: HTTPClient/ProtocolNotSuppException.

    java.lang.NoClassDefFoundError: HTTPClient/ProtocolNotSuppException

    at oracle.sysman.eml.app.ContextInitializer.contextInitialized(ContextInitializer.java:1035)

    to weblogic.servlet.internal.EventsManager$ FireContextListenerAction.run (EventsManager.java:481)

    at weblogic.security.acl.internal.AuthenticatedSubject.doAs(AuthenticatedSubject.java:321)

    at weblogic.security.service.SecurityManager.runAs(SecurityManager.java:120)

    at weblogic.servlet.internal.EventsManager.notifyContextCreatedEvent(EventsManager.java:181)

    Truncated. check the log file full stacktrace

    Caused by: java.lang.ClassNotFoundException: HTTPClient.ProtocolNotSuppException

    at weblogic.utils.classloaders.GenericClassLoader.findLocalClass(GenericClassLoader.java:297)

    at weblogic.utils.classloaders.GenericClassLoader.findClass(GenericClassLoader.java:270)

    at weblogic.utils.classloaders.ChangeAwareClassLoader.findClass(ChangeAwareClassLoader.java:64)

    at weblogic.utils.classloaders.ChangeAwareClassLoader.findClass(ChangeAwareClassLoader.java:64)

    at java.lang.ClassLoader.loadClass(ClassLoader.java:306)

    at java.lang.ClassLoader.loadClass(ClassLoader.java:247)

    Truncated. check the log file full stacktrace

    >

    < 9 July 2012 19:00:49 IST > < WARNING > < HTTP > < BEA-101162 > < oracle.sysman.eml.app.ContextInitializer listener has not defined by user: java.lang.NoClassDefFoundError: HTTPClient/ProtocolNotSuppException.

    java.lang.NoClassDefFoundError: HTTPClient/ProtocolNotSuppException

    at oracle.sysman.eml.app.ContextInitializer.contextDestroyed(ContextInitializer.java:1242)

    to weblogic.servlet.internal.EventsManager$ FireContextListenerAction.run (EventsManager.java:482)

    at weblogic.security.acl.internal.AuthenticatedSubject.doAs(AuthenticatedSubject.java:321)

    at weblogic.security.service.SecurityManager.runAs(SecurityManager.java:120)

    at weblogic.servlet.internal.EventsManager.notifyContextDestroyedEvent(EventsManager.java:200)

    Truncated. check the log file full stacktrace

    Caused by: java.lang.ClassNotFoundException: HTTPClient.ProtocolNotSuppException

    at weblogic.utils.classloaders.GenericClassLoader.findLocalClass(GenericClassLoader.java:297)

    at weblogic.utils.classloaders.GenericClassLoader.findClass(GenericClassLoader.java:270)

    at weblogic.utils.classloaders.ChangeAwareClassLoader.findClass(ChangeAwareClassLoader.java:64)

    at java.lang.ClassLoader.loadClass(ClassLoader.java:306)

    at java.lang.ClassLoader.loadClass(ClassLoader.java:247)

    Truncated. check the log file full stacktrace

    >

    < 9 July 2012 19:00:49 IST > < error > < hats > < BEA-149231 > < cannot create the activation to true for the em application state '.

    weblogic.application.ModuleException:

    at weblogic.servlet.internal.WebAppModule.startContexts(WebAppModule.java:1510)

    at weblogic.servlet.internal.WebAppModule.start(WebAppModule.java:482)

    to weblogic.application.internal.flow.ModuleStateDriver$ 3.next(ModuleStateDriver.java:425)

    at weblogic.application.utils.StateMachineDriver.nextState(StateMachineDriver.java:52)

    at weblogic.application.internal.flow.ModuleStateDriver.start(ModuleStateDriver.java:119)

    Truncated. check the log file full stacktrace

    Caused by: java.lang.ClassNotFoundException: HTTPClient.ProtocolNotSuppException

    at weblogic.utils.classloaders.GenericClassLoader.findLocalClass(GenericClassLoader.java:297)

    at weblogic.utils.classloaders.GenericClassLoader.findClass(GenericClassLoader.java:270)

    at weblogic.utils.classloaders.ChangeAwareClassLoader.findClass(ChangeAwareClassLoader.java:64)






    How to solve this problem. Pls suggest me.


    Kind regards
    Deena.

    Copy the file http_client.jar in $ORACLE_HOME/Yes/jlib to $DOMAIN_HOME/lib. Also check if the classpath has been defined for this under $DOMAIN_HOME/bin/setDomainEnv.sh jar file

    https://forums.Oracle.com/forums/thread.jspa?MessageID=10200685

  • I was doing a winpeshl.exe.error when starting "the application was not properly initialze (0xc0000006). "Click to complete the application.

    I was doing a winpeshl.exe.error when starting "the application was not properly initialze (0xc0000006). "Click to complete the application" when I click ok it reboots. I can even recover the system, tried F8 startup, alt/F10, F2, launch repair system, Safe Mode and all the rest and still get the same error. System specs are Acer Aspire 5920, Intel T5450 processor, 2 GB ram, 160 GB of HDD, windows vista edition Home premium.  I am currently under the memory diagnostic tool windows, but it is said that the test results will be displayed again once you log in, but I can't log in to view them.  The test seems to be hanging around 21% so I don't know how well it will do

    Hi A1W1LL,

    A clean boot helps eliminate software conflicts.  Let us check if software is causing the problem by following the clean boot procedure that may help you resolve the issue.

    To perform the clean boot procedure, follow the instructions in the link below.

    Step 1: Perform a clean boot
    Step 2: Enable half the services
    Step 3: Determine whether the problem returns
    Step 4: Enable half of the startup items
    Step 5: Determine whether the problem returns
    Step 6: Resolve the problem
    Step 7: Reset the computer to start as usual

    How to troubleshoot a problem by performing a clean boot in Windows Vista
    http://support.Microsoft.com/kb/929135

    After reviewing the issue, put the computer into Normal mode.
    Uninstall or update the program that is causing the problem.

    If you are not able to boot to the desktop, you can try to restore your computer from WinRE.

    1. Insert the Windows Vista installation disc in the disc drive, and then start the computer.
    2. Press any key when the message "Press any key to boot from CD or DVD".
    3. Select a language, a time and currency, and a keyboard or input method, and then click Next.
    4. click on repair your computer.
    5. in the System Recovery Options dialog box, select the drive of your Windows installation and click Next
    6. in the System Recovery Options dialog box, click System Restore.
    7. follow the instructions in the wizard to restore system as usual and choose the appropriate restore point.
    8. click Finish to restore the system.

    Please post back and let us know if it helped to solve your problem.

    Kind regards
    KarthiK TP

  • ORA-1033, ORA-00020: ERRORS WHEN STARTING THE DATABASE

    Hi... I am the server of Oracle 11 G (11.1.0.7.0) and here is the overview of the alert.log.

    It seems that 2-3 processes had problem while starting up... but later, they began... I checked in the alert file.

    ________________________________________________________________________________________
    ksuapc: ORA-1033 foreground process begins before PMON ksuapc: ORA-1033 foreground process begins before PMON ksuapc: ORA-1033 foreground process begins before PMON ksuapc: ORA-1033 foreground process begins before PMON
    ORA-00020: maximum number of errors ORA-20 process 0 overwhelmed will not be written in the journal of the alert to errors ORA-20.
    ORA-00444: background process 'CJQ0' failed during startup
    ORA-00020: maximum number of processes () exceeded
    ORA-00450: background process "CJQ0" is not started
    ORA-00444: background process 'CJQ0' failed during startup
    ORA-00020: maximum number of processes () exceeded
    ORA-00444: background process 'CJQ0' failed during startup
    ORA-00020: maximum number of processes () exceeded
    ORA-00444: background process 'CJQ0' failed during startup
    ORA-00020: maximum number of processes () exceeded
    ORA-00450: background process "CJQ0" is not started
    ORA-00444: background process 'CJQ0' failed during startup
    ORA-00020: maximum number of processes () exceeded
    ORA-00020: maximum number of errors ORA-20 process 0 overwhelmed will not be written in the journal of the alert to errors ORA-20.
    ORA-00020: maximum number of errors ORA-20 process 0 overwhelmed will not be written in the journal of the alert to errors ORA-20.
    ORA-00444: background process 'CJQ0' failed during startup
    ORA-00020: maximum number of processes () exceeded
    ORA-00020: maximum number of errors ORA-20 process 0 overwhelmed will not be written in the journal of the alert to errors ORA-20.
    ORA-00020: maximum number of errors ORA-20 process 0 overwhelmed will not be written in the journal of the alert to errors ORA-20.
    ORA-00444: background process 'OCMS' failed during startup
    ORA-00020: maximum number of processes () exceeded
    ORA-00444: background process 'OCMS' failed during startup
    ORA-00020: maximum number of processes () exceeded
    ORA-00020: maximum number of errors ORA-20 process 0 overwhelmed will not be written in the journal of the alert to errors ORA-20.
    ORA-00020: maximum number of errors ORA-20 process 0 overwhelmed will not be written in the journal of the alert to errors ORA-20.
    ORA-00444: background process 'OCMS' failed during startup
    ORA-00020: maximum number of processes () exceeded
    ORA-00444: background process 'CJQ0' failed during startup
    ORA-00020: maximum number of processes () exceeded
    ORA-00020: maximum number of errors ORA-20 process 0 overwhelmed will not be written in the journal of the alert to errors ORA-20.
    ORA-00020: maximum number of errors ORA-20 process 0 overwhelmed will not be written in the journal of the alert to errors ORA-20.
    ORA-00444: background process 'OCMS' failed during startup
    ORA-00020: maximum number of processes () exceeded
    ORA-00020: maximum number of errors ORA-20 process 0 overwhelmed will not be written in the journal of the alert to errors ORA-20.


    ________________________________________________________________________________________


    This doesn't come very often, but once in a blue moon... so is there a reason behind it? because it seems an error when starting only?

    ORA-00020: maximum number of processes (string) exceeded
    Cause: All process status objects are in use.
    Action: Increase the value of the initialization of the PROCESS parameter.

    http://download.Oracle.com/docs/CD/E11882_01/server.112/e17766/E0.htm#sthref23

  • Loading of a DLL on RT: Missing Export "DecodePointer" "Kernel32.dll" and 7 error when calling the DLL

    Hi, I recently changed to Visual Studio 2010 and Windows 7 64-bit.

    I have an existing Office RT system running RT 2009.  This system calls a DLL that I already built using Visual Studio .net 2003 and Windows XP.

    Since I've recompiled the DLL I get an error 7 file not found error when I call the RT DLL, even if I simply replaced the old DLL with a new one in the file system so the path has not changed.

    I also noticed that the message on the screen connected to the RT system during startup:

    "achieveworldpeace.dll" load error: lack of export 'DecodePointer' of ' Kernel32.dll'.

    Any ideas on this problem?  It is perhaps as simple as a switch in the compiler?

    Thank you.

    I'm not sure it's a simple switch in the project settings in Visual C. The problem is clearly in the standard C runtime library that gets linked to your DLL and refers to exports of Windows which are not available on the RT system. Don't forget that the RT system is a limited Win32 API emulation.

    I usually avoid these problems using Visual C 6 to create DLLs for LabVIEW projects. The standard library of the C runtimes will not know what Windows API reference more recent exports because they have supported even under Win95. So unless your explicitedly reference code not supported RT APIs you wouldn't have problems. If you do not use the standard C file i/o functions and management of memory in your DLL functions, you can also try to link statically C runtime libraries in your DLL, or vice versa depending on what you have now. It may or may not work. Otherwise there is not much else but by using an earlier version of Visual Studio.

  • Java class not found error when start the Weblogic servers.

    Hello:

    I'm under Weblogic Server 10.3.6 on Linux 64-bit Machine for my forms and reports 11g.

    Today, I canceled a request I installed two days ago and then when I restart the server and try to start the Server Administration Weblogic, cluster_forms, cluster_reports.

    they are all running start.

    Name of server/subsystem Sorted Ascending State health right
    http://192.168.3.44:7001/console/images/spacer.gifAdminServer Expand Node AdminServerhttp://192.168.3.44:7001/console/images/spacer.gifRUNNINGhttp://192.168.3.44:7001/console/images/spacer.gifhttp://192.168.3.44:7001/console/images/checkmark_status.gifOkhttp://192.168.3.44:7001/console/images/spacer.gif
    http://192.168.3.44:7001/console/images/spacer.gifWLS_FORMS Expand Node
    ? _nfpb = true & DispatcherPortletperspective = Setup-page & DispatcherPortlethandle=com.bea.console.handles.JMXHandle%2528%2522com.bea%253AName%253DWLS_FORMS%252CType%253DServer%2522%2529 & _pageLabel = DispatcherPage' rel = 'nofollow' > WLS_FORMShttp://192.168.3.44:7001/console/images/spacer.gifRUNNINGhttp://192.168.3.44:7001/console/images/spacer.gifhttp://192.168.3.44:7001/console/images/checkmark_status.gifOkhttp://192.168.3.44:7001/console/images/spacer.gifhttp://192.168.3.44:7001/console/images/spacer.gifWLS_REPORTS Expand Node WLS_REPORTShttp://192.168.3.44:7001/console/images/spacer.gifRUNNINGhttp://192.168.3.44:7001/console/images/spacer.gifhttp://192.168.3.44:7001/console/images/checkmark_status.gifOk

    But these business applications failed to start:

    The errors are:

    Start em: java.lang.ClassNotFoundException: org.apache.myfaces.trinidadinternal.taglib.UIXCollectionTag

    Start formsconfigmbeans: java.lang.NoClassDefFoundError: has not been initialized class oracle.forms.config.utils.FormsappConfigUtils

    Start formsapp java.lang.NoClassDefFoundError: has not been initialized class oracle.forms.config.utils.FormsappConfigUtils

    Anyone know why this is happening there?

    Track of the stack:

    # < 25 sep 2013 10:58:37 PM PDT > < error > < HTTP > < forms-reports > < AdminServer > < [pending] ExecuteThread: '7' for the queue: '(self-adjusting) weblogic.kernel.Default' > < < WLS Kernel > > <>< 6e32333635a10928:-70a358af:14158bbbc65: - 8000-0000000000000344 > < 1380175117550 > < BEA-101371 > < there was a failure during the processing of annotations for application/home/oracle/Oracle/Middleware/user_projects/domains/ClassicDomain/servers/AdminServer/tmp/_WL_user/em/hsz5x1 /. EM.war. Please make sure that annotations are valid. The error is >

    # < 25 sep 2013 10:58:37 PM PDT > < error > < hats > < forms-reports > < AdminServer > < [pending] ExecuteThread: '7' for the queue: '(self-adjusting) weblogic.kernel.Default' > < < WLS Kernel > > <>< 6e32333635a10928:-70a358af:14158bbbc65: - 8000-0000000000000344 > < 1380175117561 > < BEA-149265 > < error has occurred in the execution of the request of deployment with the ID ' 1380175115076 'for Task 4'. Error is: "weblogic.application.ModuleException: could not load the webapp: ' default" "

    weblogic.application.ModuleException: cannot load the webapp: ' / em'

    at weblogic.servlet.internal.WebAppModule.prepare(WebAppModule.java:395)

    at weblogic.application.internal.flow.ScopedModuleDriver.prepare(ScopedModuleDriver.java:176)

    at weblogic.application.internal.flow.ModuleListenerInvoker.prepare(ModuleListenerInvoker.java:199)

    to weblogic.application.internal.flow.DeploymentCallbackFlow$ 1.next(DeploymentCallbackFlow.java:517)

    at weblogic.application.utils.StateMachineDriver.nextState(StateMachineDriver.java:52)

    at weblogic.application.internal.flow.DeploymentCallbackFlow.prepare(DeploymentCallbackFlow.java:159)

    at weblogic.application.internal.flow.DeploymentCallbackFlow.prepare(DeploymentCallbackFlow.java:45)

    to weblogic.application.internal.BaseDeployment$ 1.next(BaseDeployment.java:648)

    at weblogic.application.utils.StateMachineDriver.nextState(StateMachineDriver.java:52)

    at weblogic.application.internal.BaseDeployment.prepare(BaseDeployment.java:191)

    at weblogic.application.internal.EarDeployment.prepare(EarDeployment.java:59)

    at weblogic.application.internal.DeploymentStateChecker.prepare(DeploymentStateChecker.java:154)

    at weblogic.deploy.internal.targetserver.AppContainerInvoker.prepare(AppContainerInvoker.java:60)

    at weblogic.deploy.internal.targetserver.operations.ActivateOperation.createAndPrepareContainer(ActivateOperation.java:208)

    at weblogic.deploy.internal.targetserver.operations.ActivateOperation.doPrepare(ActivateOperation.java:98)

    at weblogic.deploy.internal.targetserver.operations.AbstractOperation.prepare(AbstractOperation.java:217)

    at weblogic.deploy.internal.targetserver.DeploymentManager.handleDeploymentPrepare(DeploymentManager.java:747)

    at weblogic.deploy.internal.targetserver.DeploymentManager.prepareDeploymentList(DeploymentManager.java:1216)

    at weblogic.deploy.internal.targetserver.DeploymentManager.handlePrepare(DeploymentManager.java:250)

    at weblogic.deploy.internal.targetserver.DeploymentServiceDispatcher.prepare(DeploymentServiceDispatcher.java:159)

    at weblogic.deploy.service.internal.targetserver.DeploymentReceiverCallbackDeliverer.doPrepareCallback(DeploymentReceiverCallbackDeliverer.java:171)

    to weblogic.deploy.service.internal.targetserver.DeploymentReceiverCallbackDeliverer.access$ 000 (DeploymentReceiverCallbackDeliverer.java:13)

    to weblogic.deploy.service.internal.targetserver.DeploymentReceiverCallbackDeliverer$ 1.run(DeploymentReceiverCallbackDeliverer.java:46)

    to weblogic.work.SelfTuningWorkManagerImpl$ WorkAdapterImpl.run (SelfTuningWorkManagerImpl.java:545)

    at weblogic.work.ExecuteThread.execute(ExecuteThread.java:256)

    at weblogic.work.ExecuteThread.run(ExecuteThread.java:221)

    Caused by: java.lang.ClassNotFoundException: org.apache.myfaces.trinidadinternal.taglib.UIXCollectionTag

    in java.net.URLClassLoader$ 1.run(URLClassLoader.java:202)

    at java.security.AccessController.doPrivileged (Native Method)

    at java.net.URLClassLoader.findClass(URLClassLoader.java:190)

    at java.lang.ClassLoader.loadClass(ClassLoader.java:306)

    to Sun.misc.Launcher$appclassloader$ AppClassLoader.loadClass (Launcher.java:301)

    at java.lang.ClassLoader.loadClass(ClassLoader.java:247)

    at java.lang.ClassLoader.defineClass1 (Native Method)

    at java.lang.ClassLoader.defineClassCond(ClassLoader.java:631)

    at java.lang.ClassLoader.defineClass(ClassLoader.java:615)

    at java.security.SecureClassLoader.defineClass(SecureClassLoader.java:141)

    Problem solved, I set several environment variables in the file .bash_profile, the CLASS_PATH crashing classpath of weblogic server during startup.

    Remove them and restart the server solved my problem.

  • Error when starting the database

    I put the log_archive_dest1 = a: \app\administrator\orcl\archive' parameter and shutting down the database. When I tried to start up the db, I got the following error:
    SQL > bootable media.
    ORA-16032: parameter LOG_ARCHIVE_DEST_1 destination string cannot be translated.
    ORA-09291: sksachk: invalid device specified for the destination of archive
    OSD-04018: cannot access the specified directory or device.

    You probably have a leak-on the dir name IE, D:\app\administrator\orcl\archive\
    (1) ensure that the permissions on the path of the file that you are using the database in reading / writing?
    (2) make sure all the folders in the path already exist
    (3) under Windows, you might find the '-' characters confuse the database. Specify any other paths in the same way for Oracle? An alternative would be to use ' / ' instead of '-'. Different programs that originated in the Unix world handle Windows paths differently

  • Purple screen United immediately after ESXi 5 loading bar when starting the installation disc.

    I have a client that is running ESX 4.0 on a compatible with ESXi 5 host.  When I went to upgrade the host to ESXi 5 I ran into a problem, I have never seen elsewhere.  I started on the disk and screen with the status bar at the top is fine.  Immediately after loading, before showing always the yellow background or license agreement, he throws a Uni purple screen and without words.  If you leave it for about 20 seconds, then the screen goes black with gray blocks randomly everywhere.  I tried with another download and CD but I get the same results.  I couldn't find anything on purple screens without the current text.  Any help would be greatly appreciated!

    Did you check if the version of the BIOS of the host must be updated in order to run ESXi 5.0?

    André

  • check error when start the game after downloading the jad/jar by OTA on BB 8300

    Should I wear a for BB 8800 version J2ME Java game. So far the alx/jad/cod format works fine on BB devices, such as 8800, 8300, 8310. Now I have to commit a jad/jar format. I make the version using proguard 3.8 and WTK22 preverify. On BB 8800, the jad/jar can be downloaded to the device, when it is running the game, there is an error msg 'Error at startup xxxx xxxx for Module a verification error at offset xxxx xxxx', the version is OK on BB 8310, but failed on BB 8800 and 8300.It is so strange. I'm trying to do the version using the preverify CAP and failed once again, use 3.3.2 proguard / 3.7 failed too. It seems that it is a consistent problem.

    I check the article 'Support - MIDlet has error checking to offset' and have no harvest.

    How to fix the bug?

    Thanks for your help.

    Use rapc.exe to jar with proguard not preverify, I corrected the bug. There maybe some problems during transfer cod jar in the device.

  • MS Visual C ++ Runtime Library Runtime C/Program files/real/Real Player / Real Play.exe R6035 - cell function pure virtual error when starting the computer

    Original title:

    When the computer starts, this message to MS Visual C ++ Runtime Library C/program files/real/Real Player / Real pure R6035 - virtual function cell Play.exe

    Hello

    1 how long have you been faced with this problem?
    2 have you made changes on the computer before this problem?

    I suggest you perform the clean boot on the computer.

    From your computer by using a minimal set of drivers and startup programs so that you can determine if a background program is interfering with your game or program. This type of boot is known as a "clean boot".

    Reference:
    How to configure Windows XP to start in a "clean boot" State
    http://support.Microsoft.com/kb/310353

    When you are finished troubleshooting, follow these steps to reset the computer to start as usual:
    1. click on Startand then click run.
    2. type msconfigand click OK.

    The System Configuration Utility dialog box appears.

    3. click on the general tab, click Normal startup - load all services and device drivers and then click OK.
    4. When prompted, click on restart to restart the computer.

  • Re: Satellite L670 - error when starting the BIOS update

    Using the Toshiba Service Station, he warned me an update. The update is called "Satellite L670/L675, Satellite Pro L670, update BIOS Version 1.50". When I install the update, it gives me this error: "there was an error, please check below the elements.» More than 150 BIOS version. Battery capacity more than 10%. AC is attached.

    I tried the update when my battery was 100% and the captain was connected, and yet I still get the error.

    Can someone help me with this?

    Hello

    Firstly I have to say if you don t have any problems with your computer forget this update. BIOS update is required only if you really have problems, otherwise I don't such updated risky.

    Anyway, if you download the update of the BIOS, you will need to extract all files of archive zip first before start you. Also, make sure that you are logged on as administrator.

  • Get the error when starting the server weblogic 10.3.6

    Hi guys,.

    Can you please throw some light on this error:

    C:\Oracle\Middleware\user_projects\domains\atg_domain\bin > startWebLogic.cmd

    .

    .

    Memory of JAVA arguments:-Xms1152m-Xmx2048m

    .

    Start mode of WLS = development

    .

    CLASSPATH=C:\Oracle\MIDDLE~1\patch_wls1036\profiles\default\sys_manifest_classpath\weblogic_patch.jar; C:\Oracle\MIDDLE~1\patch_oepe180\profiles\default\sys_mani

    .

    Path = C:\Oracle\MIDDLE~1\patch_wls1036\profiles\default\native; C:\Oracle\MIDDLE~1\patch_oepe180\profiles\default\native; C:\Oracle\MIDDLE~1\patch_ocp371\profiles\

    .

    ***************************************************

    * To start WebLogic Server, use a username and *.

    * password assigned to an administrator-level user.  For *.

    * server administration, using the WebLogic Server *.

    * the http://hostname:port\console console *.

    ***************************************************

    from weblogic with the Java version:

    Java version "1.7.0_55".

    Java (TM) SE Runtime Environment (build 1.7.0_55 - b13)

    Java for 64-bit Server VM (build 24, 55 - b03, mixed mode)

    WLS starting with line:

    C:\java\jdk_7\bin\java-client-Xms1152m-Xmx2048m-Dweblogic.name=AdminServer-Djava.Security.policy=C:\Oracle\MIDDLE~1\WLSERV~1.3\server\lib\weblogic.policy

    Error: Could not find or load the class main Uxmx2048m

    C:\Oracle\Middleware\user_projects\domains\atg_domain\bin >

    Thank you

    Looks like there is an extra character added - did copy you + paste the Xmx value in scripts?

    Error: Could not find or load the class main Uxmx2048m

    Delete it and retyping the values.

  • Errors when starting the samples global services in server Virgo

    After you have imported the Global View UI sample and service, by adding them to the server list of these errors:

    [17:42:25.522 2013-01-11] [INFO] 2 - 127.0.0.1 < ME0003I > connection TCP Dump "C:\ProgramData\vmware\vSphere Client\serviceability\dump\2013-01-11-17-42-507 Web" generated
    [17:42:25.538 2013-01-11] [ERROR]  Installation 2 - 127.0.0.1 < DE0002E > TCP connection to "com.vmware.samples.globalviewui" in release ' 1.0.0' has failed. "org.eclipse.virgo.kernel.osgi.framework.UnableToSatisfyBundleDependenciesException: unable to satisfy dependencies of the package 'com.vmware.samples.globalviewui' to release ' 1.0.0 ': could not resolve: com.vmware.samples.globalviewui
    Report of resolver:
    A Package Import could not be resolved. Caused by the constraint missing bundled < com.vmware.samples.globalviewui_1.0.0 >
    constraint: Import-Package: com.vmware.vise.messaging.remoting; version = "0.0.0" >
    A Package Import could not be resolved. Caused by the constraint missing bundled < com.vmware.amfext_1.0.0 >
    constraint: Import-Package: com.vmware.vise.data.query; version = "0.0.0" >

    at org.eclipse.virgo.kernel.install.pipeline.stage.resolve.internal.QuasiResolveStage.process(QuasiResolveStage.java:45)
    at org.eclipse.virgo.kernel.install.pipeline.internal.StandardPipeline.doProcessTree(StandardPipeline.java:62)
    at org.eclipse.virgo.kernel.install.pipeline.internal.CompensatingPipeline.doProcessTree(CompensatingPipeline.java:72)
    at org.eclipse.virgo.kernel.install.pipeline.stage.AbstractPipelineStage.process(AbstractPipelineStage.java:41)
    at org.eclipse.virgo.kernel.install.pipeline.internal.StandardPipeline.doProcessTree(StandardPipeline.java:62)
    at org.eclipse.virgo.kernel.install.pipeline.stage.AbstractPipelineStage.process(AbstractPipelineStage.java:41)
    at org.eclipse.virgo.kernel.deployer.core.internal.PipelinedApplicationDeployer.driveInstallPipeline(PipelinedApplicationDeployer.java:285)
    at org.eclipse.virgo.kernel.deployer.core.internal.PipelinedApplicationDeployer.doInstall(PipelinedApplicationDeployer.java:164)
    at org.eclipse.virgo.kernel.deployer.core.internal.PipelinedApplicationDeployer.install(PipelinedApplicationDeployer.java:136)
    at org.eclipse.virgo.kernel.deployer.core.internal.PipelinedApplicationDeployer.deploy(PipelinedApplicationDeployer.java:203)
    at org.eclipse.virgo.kernel.deployer.management.StandardDeployer.deploy(StandardDeployer.java:52)
    at sun.reflect.NativeMethodAccessorImpl.invoke0 (Native Method)
    at sun.reflect.NativeMethodAccessorImpl.invoke(NativeMethodAccessorImpl.java:39)
    at sun.reflect.DelegatingMethodAccessorImpl.invoke(DelegatingMethodAccessorImpl.java:25)
    at java.lang.reflect.Method.invoke(Method.java:597)
    at com.sun.jmx.mbeanserver.ConvertingMethod.invokeWithOpenReturn(ConvertingMethod.java:167)
    at com.sun.jmx.mbeanserver.MXBeanIntrospector.invokeM2(MXBeanIntrospector.java:96)
    at com.sun.jmx.mbeanserver.MXBeanIntrospector.invokeM2(MXBeanIntrospector.java:33)
    at com.sun.jmx.mbeanserver.MBeanIntrospector.invokeM(MBeanIntrospector.java:208)
    at com.sun.jmx.mbeanserver.PerInterface.invoke(PerInterface.java:120)
    at com.sun.jmx.mbeanserver.MBeanSupport.invoke(MBeanSupport.java:262)
    at com.sun.jmx.interceptor.DefaultMBeanServerInterceptor.invoke(DefaultMBeanServerInterceptor.java:836)
    at com.sun.jmx.mbeanserver.JmxMBeanServer.invoke(JmxMBeanServer.java:761)
    at javax.management.remote.rmi.RMIConnectionImpl.doOperation(RMIConnectionImpl.java:1454)
    to javax.management.remote.rmi.RMIConnectionImpl.access$ 300 (RMIConnectionImpl.java:74)
    to javax.management.remote.rmi.RMIConnectionImpl$ PrivilegedOperation.run (RMIConnectionImpl.java:1295)
    at javax.management.remote.rmi.RMIConnectionImpl.doPrivilegedOperation(RMIConnectionImpl.java:1387)
    at javax.management.remote.rmi.RMIConnectionImpl.invoke(RMIConnectionImpl.java:818)
    at sun.reflect.NativeMethodAccessorImpl.invoke0 (Native Method)
    at sun.reflect.NativeMethodAccessorImpl.invoke(NativeMethodAccessorImpl.java:39)
    at sun.reflect.DelegatingMethodAccessorImpl.invoke(DelegatingMethodAccessorImpl.java:25)
    at java.lang.reflect.Method.invoke(Method.java:597)
    at sun.rmi.server.UnicastServerRef.dispatch(UnicastServerRef.java:303)
    to sun.rmi.transport.Transport$ 1.run(Transport.java:159)
    at java.security.AccessController.doPrivileged (Native Method)
    at sun.rmi.transport.Transport.serviceCall(Transport.java:155)
    at sun.rmi.transport.tcp.TCPTransport.handleMessages(TCPTransport.java:535)
    to sun.rmi.transport.tcp.TCPTransport$ ConnectionHandler.run0 (TCPTransport.java:790)
    to sun.rmi.transport.tcp.TCPTransport$ ConnectionHandler.run (TCPTransport.java:649)
    to java.util.concurrent.ThreadPoolExecutor$ Worker.runTask (ThreadPoolExecutor.java:886)
    to java.util.concurrent.ThreadPoolExecutor$ Worker.run (ThreadPoolExecutor.java:908)
    at java.lang.Thread.run(Thread.java:662)

    [17:42:25.554 2013-01-11] [ERROR]  Installation of 2 - 127.0.0.1 < DE0003E > TCP connection failed for 'com.vmware.samples.globalviewui' in ' 1.0.0 version".
    [17:42:25.554 2013-01-11] [ERROR]  TCP connection 2 - 127.0.0.1 < DE0500E > cannot install the application of URI "file:/C:/VMware/vSphereWebClient/server/stage/globalview-ui.war". "Cannot satisfy the constraints of in 'com.vmware.samples.globalviewui' release ' 1.0.0 '. Impossible to solve: com.vmware.samples.globalviewui
    Report of resolver:
    A Package Import could not be resolved. Caused by the constraint missing bundled < com.vmware.samples.globalviewui_1.0.0 >
    constraint: Import-Package: com.vmware.vise.messaging.remoting; version = "0.0.0" >
    A Package Import could not be resolved. Caused by the constraint missing bundled < com.vmware.amfext_1.0.0 >
    constraint: Import-Package: com.vmware.vise.data.query; version = "0.0.0" >
    . "org.eclipse.virgo.kernel.osgi.framework.UnableToSatisfyBundleDependenciesException: unable to satisfy dependencies of the package 'com.vmware.samples.globalviewui' to release ' 1.0.0 ': could not resolve: com.vmware.samples.globalviewui
    Report of resolver:
    A Package Import could not be resolved. Caused by the constraint missing bundled < com.vmware.samples.globalviewui_1.0.0 >
    constraint: Import-Package: com.vmware.vise.messaging.remoting; version = "0.0.0" >
    A Package Import could not be resolved. Caused by the constraint missing bundled < com.vmware.amfext_1.0.0 >
    constraint: Import-Package: com.vmware.vise.data.query; version = "0.0.0" >

    at org.eclipse.virgo.kernel.install.pipeline.stage.resolve.internal.QuasiResolveStage.process(QuasiResolveStage.java:45)
    at org.eclipse.virgo.kernel.install.pipeline.internal.StandardPipeline.doProcessTree(StandardPipeline.java:62)
    at org.eclipse.virgo.kernel.install.pipeline.internal.CompensatingPipeline.doProcessTree(CompensatingPipeline.java:72)
    at org.eclipse.virgo.kernel.install.pipeline.stage.AbstractPipelineStage.process(AbstractPipelineStage.java:41)
    at org.eclipse.virgo.kernel.install.pipeline.internal.StandardPipeline.doProcessTree(StandardPipeline.java:62)
    at org.eclipse.virgo.kernel.install.pipeline.stage.AbstractPipelineStage.process(AbstractPipelineStage.java:41)
    at org.eclipse.virgo.kernel.deployer.core.internal.PipelinedApplicationDeployer.driveInstallPipeline(PipelinedApplicationDeployer.java:285)
    at org.eclipse.virgo.kernel.deployer.core.internal.PipelinedApplicationDeployer.doInstall(PipelinedApplicationDeployer.java:164)
    at org.eclipse.virgo.kernel.deployer.core.internal.PipelinedApplicationDeployer.install(PipelinedApplicationDeployer.java:136)
    at org.eclipse.virgo.kernel.deployer.core.internal.PipelinedApplicationDeployer.deploy(PipelinedApplicationDeployer.java:203)
    at org.eclipse.virgo.kernel.deployer.management.StandardDeployer.deploy(StandardDeployer.java:52)
    at sun.reflect.NativeMethodAccessorImpl.invoke0 (Native Method)
    at sun.reflect.NativeMethodAccessorImpl.invoke(NativeMethodAccessorImpl.java:39)
    at sun.reflect.DelegatingMethodAccessorImpl.invoke(DelegatingMethodAccessorImpl.java:25)
    at java.lang.reflect.Method.invoke(Method.java:597)
    at com.sun.jmx.mbeanserver.ConvertingMethod.invokeWithOpenReturn(ConvertingMethod.java:167)
    at com.sun.jmx.mbeanserver.MXBeanIntrospector.invokeM2(MXBeanIntrospector.java:96)
    at com.sun.jmx.mbeanserver.MXBeanIntrospector.invokeM2(MXBeanIntrospector.java:33)
    at com.sun.jmx.mbeanserver.MBeanIntrospector.invokeM(MBeanIntrospector.java:208)
    at com.sun.jmx.mbeanserver.PerInterface.invoke(PerInterface.java:120)
    at com.sun.jmx.mbeanserver.MBeanSupport.invoke(MBeanSupport.java:262)
    at com.sun.jmx.interceptor.DefaultMBeanServerInterceptor.invoke(DefaultMBeanServerInterceptor.java:836)
    at com.sun.jmx.mbeanserver.JmxMBeanServer.invoke(JmxMBeanServer.java:761)
    at javax.management.remote.rmi.RMIConnectionImpl.doOperation(RMIConnectionImpl.java:1454)
    to javax.management.remote.rmi.RMIConnectionImpl.access$ 300 (RMIConnectionImpl.java:74)
    to javax.management.remote.rmi.RMIConnectionImpl$ PrivilegedOperation.run (RMIConnectionImpl.java:1295)
    at javax.management.remote.rmi.RMIConnectionImpl.doPrivilegedOperation(RMIConnectionImpl.java:1387)
    at javax.management.remote.rmi.RMIConnectionImpl.invoke(RMIConnectionImpl.java:818)
    at sun.reflect.NativeMethodAccessorImpl.invoke0 (Native Method)
    at sun.reflect.NativeMethodAccessorImpl.invoke(NativeMethodAccessorImpl.java:39)
    at sun.reflect.DelegatingMethodAccessorImpl.invoke(DelegatingMethodAccessorImpl.java:25)
    at java.lang.reflect.Method.invoke(Method.java:597)
    at sun.rmi.server.UnicastServerRef.dispatch(UnicastServerRef.java:303)
    to sun.rmi.transport.Transport$ 1.run(Transport.java:159)
    at java.security.AccessController.doPrivileged (Native Method)
    at sun.rmi.transport.Transport.serviceCall(Transport.java:155)
    at sun.rmi.transport.tcp.TCPTransport.handleMessages(TCPTransport.java:535)
    to sun.rmi.transport.tcp.TCPTransport$ ConnectionHandler.run0 (TCPTransport.java:790)
    to sun.rmi.transport.tcp.TCPTransport$ ConnectionHandler.run (TCPTransport.java:649)
    to java.util.concurrent.ThreadPoolExecutor$ Worker.runTask (ThreadPoolExecutor.java:886)
    to java.util.concurrent.ThreadPoolExecutor$ Worker.run (ThreadPoolExecutor.java:908)
    at java.lang.Thread.run(Thread.java:662)

    Did you add this example while the server is already running (whereby cases it should work) or you start/restart of the server (to which case you must use the delay-Deployer tool as described in the SDK documentation, see the FAQ and the SDK Tutorial)

  • Unknown BIOS 8302 error when starting the computer

    Original title: error code 8302

    Whenever I turn on my computer, I have to press F1. A screen pops up saying

    Check the NVRAM...

    Unknown BIOS error.

    Error code = 8302

    Press F1 to resume

    What it means and how to fix it? He used to start fine then all of a suuden one day he started this dong.

    Hello

    Have you tried to delete / reset the CMOS? This error starts occurring when the BIOS starts to lose its information, which can sometimes be resolved by updating / flashing BIOS as recommended above. If it does not, the Council will have to be replaced or repaired.

    Kind regards

    Patrick

  • 2329 error when start the Java Setup

    When I try to install Java (TM) 6 Update 26 on my WinXP SP3, I get a messege "Internet error 2329" 32 C:\Config.Msi\20004b.rbf. I have download and install windows install 4.5, but the problem is still ongoing. Some time it displays '2329 error' and some time shows "error 1011". What should I do?

    Hello

    · You have an earlier version of Java installed on the computer?

    I suggest you follow the steps (section: problems of Windows Installer) link: how to solve the problems that may occur when you install, uninstall, or upgrade one program on a Windows computer: http://support.microsoft.com/kb/2438651

    You can also check the link: installation of Java: http://www.java.com/en/download/help/index_installing.xml

    For further assistance, you can also contact: technical support Options: http://www.java.com/en/download/support.jsp

  • Maybe you are looking for

    http://192.168.3.44:7001/console/images/spacer.gifem Expand Node Enterprise Application EMhttp://192.168.3.44:7001/console/images/spacer.gifPreparedhttp://192.168.3.44:7001/console/images/spacer.gifhttp://192.168.3.44:7001/console/images/spacer.gifEnterprise applicationhttp://192.168.3.44:7001/console/images/spacer.gif400
    http://192.168.3.44:7001/console/images/spacer.gifformsconfigmbeans Expand Node Enterprise Application formsconfigmbeanshttp://192.168.3.44:7001/console/images/spacer.gifhttp://192.168.3.44:7001/console/images/spacer.gifhttp://192.168.3.44:7001/console/images/spacer.gifEnterprise applicationhttp://192.168.3.44:7001/console/images/spacer.gif100
    http://192.168.3.44:7001/console/images/spacer.gifformsapp (11.1.2) Expand Node Enterprise Application formsapp (11.1.2)http://192.168.3.44:7001/console/images/spacer.gifFailedhttp://192.168.3.44:7001/console/images/spacer.gifhttp://192.168.3.44:7001/console/images/spacer.gifEnterprise applicationhttp://192.168.3.44:7001/console/images/spacer.gif100