Error of vi-1074395247 IMAQ learn model 2.

Hello

Development environment:

  • LabVIEW 2012 32-bit (12.0f3)
  • Vision 2012

Description:

Can someone please shed some light on what types of descriptors of the KING are allowed for IMAQ learn ringtone 2?. Only certain KING types allowed for this VI, or you can use any type? I want to create a template with a mask image - KING type descriptors defined in polygon - what is possible or valid?

I get the 1074395247 error: "invalid template descriptor '.

However, just by simply changing the return on investment of the Rectangle type (and the coordinates to respond), I don't get this error (although it does not properly hide pixels I don't need)

Thank you!

Advertisement

Hi Chris,

I think you should be able to create a return on investment with a polygon.  Please see this example: https://decibel.ni.com/content/docs/DOC-25241

Thank you!

Tags: NI Hardware

Similar Questions

  • Need of additional documentation for "IMAQ Match model 2 VI" and "IMAQ learn model 2 VI.


    Zoli,

    According to me, is part of the intellectual property or information you request and therefore is not public.

    In any case, one thing I would try is patent search OR.

  • IMAQ learn ringtone 2 "learn the mask."

    People,

    In my documentation of IMAQ learn ringtone 2, there is no explanation of the work option "mask to learn." Can someone explain it to me briefly?

    TIA,

    Candice


  • Panel of Dreamweaver shows 50 + errors in jQuery working with Bootstrap model

    Dreamweaver Panel 50 + errors in the jQuery file. I work with a bootstrap model.  File name: jquery - 1.11.2 I am trying to learn and don't know what to do next.

    You talk about mistakes of Linting, highlighted line numbers in view Code of CC 2015?

    If so (and you have not made changes to the jquery file) ignore the feature of Linting in DW is a little overzealous.

  • "Reading DMA Ext" SMART error reported for a 27 "Mac (model end 2013)

    Hello

    I have experienced a strange behavior in last week, where my iMac starts upward normally, but directly obtained subsequently very slow and lazy. Each program showed the wait mouse cursor und switch between programs by using the Task Manager did not work. If available, I could click through the mouse on a different program of an application window, but only to bring in the und before then the wait cursor shown here as well.

    I had to reboot several times, until all behaved as usual.

    I checked the State of the disk hard und SMART monitor indicated failures during the power on unit (UNC at LBA). And it seemed that this error has occurred several times (once at the start of the iMac, I retried several times).

    I installed the tool console smartctl to get more detailed information and it reported an error count of 534 where were the last 4 errors of this type (history does not seem to store more errors). The last error reported was of type READ FPDMA queued (global error at LBA UNC).

    I ran a SMART long test, which passed without error.

    And if the system boots properly, there is no indication that the hard disk has a problem.

    Someone knows something similar and has a suggestion, what to do? Is there something wrong with the hard drive, controller, plugging in the cable?

    I really appreciate your thought and suggestions about this strange behavior.

    Thank you for your support in advance!

    Best regards

    René

    Here some information copied from the smartctl journal:

    ----------------------------------------------------------

    = START OF SECTION INFORMATION =.

    Phone model: APPLE disk HARD ST1000DM003

    Serial number: S1DCF1AX

    LU WWN device ID: 5 000c 50 061b9b612

    Firmware version: AP18

    [User capability: 1,000,204,886,016 1.00 TB bytes]

    Sector size: 512 byte logical, physical 4 096 bytes

    Rotation speed: 7200 RPM

    Form factor: 3.5 inches

    Device is: not in smartctl database [for details: showall - P]

    ATA Version is: DCC-2, 3-ACS T13 / 2161 - D revision 3B

    SATA version: SATA 3.1, 6.0 GB/s (current: 3.0 Gb/s)

    Local time is: Sun Jul 10 12:04:36 CEST 2016

    SMART support is: available - device has SMART capability.

    SMART support is: enabled

    = START OF SECTION ERROR =.

    Error 534 to disk works to life: 6143 hours (255 days + 23)

    When the command that caused the error occurred, the aircraft was active or inactive.

    After the completion of the order has occurred, the registers were:

    ST ST SC SN CL CH DH

    -- -- -- -- -- -- --

    40 51 00 70 b4 76 01 error: UNC at LBA = 0x0176b470 = 24556656

    Orders, leading to the command that caused the error were:

    CR EN SC SN CL CH DH DC Powered_Up_Time command/Feature_Name

    -- -- -- -- -- -- -- --  ----------------  --------------------

    25 00 20 70 76 41 00 00:27:49.218 LU DMA EXT b4

    25 00 20 70 76 41 00 00:27:45.476 LU DMA EXT b4

    25 00 20 70 76 41 00 00:27:41.811 LU DMA EXT b4

    25 00 20 70 76 41 00 00:27:38.207 LU DMA EXT b4

    25 00 10 88 08 40 00 00:27:38.204 LU DMA EXT c6

    ...

    Error 530 to disk works to life: 6143 hours (255 days + 23)

    When the command that caused the error occurred, the aircraft was active or inactive.

    After the completion of the order has occurred, the registers were:

    ST ST SC SN CL CH DH

    -- -- -- -- -- -- --

    40 51 00 70 b4 76 01 error: UNC at LBA = 0x0176b470 = 24556656

    Orders, leading to the command that caused the error were:

    CR EN SC SN CL CH DH DC Powered_Up_Time command/Feature_Name

    -- -- -- -- -- -- -- --  ----------------  --------------------

    60 00 20 70 76 41 00 00:27:34.254 LU FPDMA queued b4

    60 00 10 88 08 40 00 00:27:34.254 LU FPDMA queued c6

    60 00 10 18 22 20 40 00 00:27:34.254 READ FPDMA QUEUED

    60 00 10 a8 c7 1 d 40 00 00:27:34.254 READ FPDMA queued

    60 00 08 ff ff ff 4f 00 00:27:34.150 READ FPDMA queued

    It's a lot of information that virtually no one knows what to do with... but my guess is that everything points to a failing hard drive.

  • 0x000000C2 after connection XP SP2 BSOD error - cannot find the drivers for model

    Hello
    Windows XP from. Once the connection with password, it immediately crashes with the following error:
    0x000000C2 (0 x 00000043, 0xD76A2000, 0, 0)

    Try using ERD - but it does not find the system of windows XP - made notrecognizes hard drive - need special driver for the amorçage using F6.
    But what is the driver, and how can I find it?

    * find any hd driver.*
    * can't find my specific model of laptop *.

    my laptop model is NOT listed in the database to support toshiba, OR recording of my laptop:
    Satellite Pro A200 - EZ2205X system unit
    model No. PSAF4U - 00L 004

    also falling series. the results as invalid. ???
    Help, please!

    Post edited by: zhelp

    Your laptop is definitely written but you probably searched on the wrong page. Your model is WE model then please look for drivers on http://www.csd.toshiba.com/cgi-bin/tais/su/su_sc_modSel.jsp

    You want to the new installation of Windows XP Home edition? What you need is driver SATA and it must be loaded before installation WXO begins. This driver must be load with F6.
    I put t know which chipset your laptop model, but please see THIS page for how to find it.

  • How to solve the error-1074396080 appeared in IMAQ Image color table

    Hello

    I'm above mentioned error.

    Here, I have attached my screenshot of the error.

    Could any one please guide me how to solve this error.

    I use kinect driver kinesthesia generating U24 Bit RGB Image and I want to convert it to Image IMAQ type, but I get an error mentioned.

    But when I do not use the acquisition of vision and vision assistant then every thing is good average is no any error which I have attached in annex 2.

    Please guide me how to solve this problem.

    Thank you very much.


  • Nested editable region error - but I have no nested model

    Hello:

    Decipher an error message: I need help.

    I have a global model for my site. It was working fine, then it has been disconnected from the site when my computer crashed, so I plugged back it it using site manager and import the .ste file. Now when I try to save the template or use the model, I get an error message which makes it seem like I have a nested template, but I'm not using nested templates.

    Here is what the error message says:

    There is an error on line 117, column 7, position absolute 2195

    Nested editable region

    Here's what the beginner code @ 111 line looks like:

    H6 {}
    font size: 1.1em;
    color: #960;
    }
    ->
    < / style >
    < body >
    < table width = "794" border = "0" align = "center" cellpadding = "0" cellspacing = "0" bgcolor = "#FFFFFF" >
    < b >
    < td colspan = "2" >
    "" < img src = "... / logo/brown_new_orange.jpg ' width = '807' height = '112' alt = 'Brown Golden Colorado chiropractic' > < table >
    < /tr >

    The < body > tag is at line 111. I checked for the end tag, and it seems fine. I also ran the command to check html and it found no errors.

    Any ideas what I did to generate this error message frustrating or how I can fix this problem.

    I'm not super tech savvy. I know enough to be dangerous.

    Thanks for any help you might be able to offer.

    Cindy

    Invalid HTML table height is - there never is part of the HTML language.  The content determines the height.  His presence on the page, however, is of no consequence to almost everything and this particular question.  You should be working fine with this page now...

  • Totally confused about error message when you save the model.

    I am a total novice - teach myself that I'm going through all the tutorials.  I built my index page off the Dreamweaver to build your first Web site tutorial.  I posted a question about a model from this page, and he responded by sending me a link to "The Missing Manual". I followed the instructions to make the template and editable regions and I get the error the talks from trying to save an editable region within block-level elements, but I do not understand how to fix it.

    Areas I'm trying to make editable are my navigation bar on the left that has been created in a table as the tutorial said using the block function in CSS styles.  As I used it, not make the editable region? My navigation is locked or I'll be able to change the navigation from one page to the other buttons?  I have read so many things I've confused myself.

    The excerpt that gives a good description of how repair if you have not used the field block to the style of the page, but I'm confused about what to do as I did?

    Help!

    Kellysingleton wrote:

    I am a total novice - teach myself that I'm going through all the tutorials.  I built my index page off the Dreamweaver to build your first Web site tutorial.  I posted a question about a model from this page, and he responded by sending me a link to "The Missing Manual". I followed the instructions to make the template and editable regions and I get the error the talks from trying to save an editable region within block-level elements, but I do not understand how to fix it.

    Areas I'm trying to make editable are my navigation bar on the left that has been created in a table as the tutorial said using the block function in CSS styles.  As I used it, not make the editable region? My navigation is locked or I'll be able to change the navigation from one page to the other buttons?  I have read so many things I've confused myself.

    The excerpt that gives a good description of how repair if you have not used the field block to the style of the page, but I'm confused about what to do as I did?

    Help!

    First off you need to create a model of 'master' NOT an index page. The index page is created from the "master" template

    Explained simply: build a page as you like in Dreamweaver, and save it as a template for the folder root of your site. File > save as template

    Then you can create pages of your site from the "master" template File > new > template > choose Site folder > select model > create

    You now have a new page, based on the model of 'master '. Save it with the name index.html in the folder of your site.

    Your 'master' model has no editable now region then open it in Dreamweaver. Insert your cursor in the table cell where is your left navigation and then select themark along the bottom of the Dreamweaver window. Choose now your navigation overall is in the table cell to make you an ' editable '.

    Go > insert > template objects > editable region. Name LeftNavigation, and then click ok. You will see that your navigation has now been wrapped in an editable region. Save the model of 'master' and the changes will be reflected in the index.html page, which was created from the "master" template

  • Errors in the application of the model of AutoConfig T2K patch 7237313

    Hello

    I subscribe to the patch 7237313 Model AutoConfig T2K patch on a Windows Server 2003 R2 and I get errors. Here is the content of the adrelink.log.

    Current product is #.
    adrelink: warning: no setting not L #LIB
    as there is no 1_TOP/lib/#st.lib
    or cannot be read.
    adrelink: warning: no setting not L #STLIB
    as there is no 1_TOP/lib/#st.lib
    or cannot be read.

    /cygdrive/e/Oracle/prod/apps/apps_st/appl/ad/12.0.0/bin/adrelinknew.sh: line
    2020: _TOP: command not found
    adrelink: WARNING: product ' | ' is listed as an Oracle Applications
    Product or a customized product, but | _Top is not defined.

    adrelink: WARNING: product 'DESCRIPTION' is listed as an Oracle Applications
    Product or as a custom product, but DESCRIPTION_TOP is not defined.

    Current product is #.
    adrelink: warning: no setting not L #LIB
    as there is no 1_TOP/lib/#st.lib
    or cannot be read.
    adrelink: warning: no setting not L #STLIB
    as there is no 1_TOP/lib/#st.lib
    or cannot be read.

    /cygdrive/e/Oracle/prod/apps/apps_st/appl/ad/12.0.0/bin/adrelinknew.sh: line
    2020: _TOP: command not found
    adrelink: WARNING: product ' | ' is listed as an Oracle Applications
    Product or a customized product, but | _Top is not defined.

    adrelink: WARNING: product 'Filename' is listed as an Oracle Applications
    Product or as a custom product, but FILENAME_TOP is not defined.

    Current product is #.
    adrelink: warning: no setting not L #LIB
    as there is no 1_TOP/lib/#st.lib
    or cannot be read.
    adrelink: warning: no setting not L #STLIB
    as there is no 1_TOP/lib/#st.lib
    or cannot be read.

    /cygdrive/e/Oracle/prod/apps/apps_st/appl/ad/12.0.0/bin/adrelinknew.sh: line
    2020: _TOP: command not found
    adrelink: WARNING: product ' | ' is listed as an Oracle Applications
    Product or a customized product, but | _Top is not defined.

    adrelink: WARNING: 'NOTES' product is listed as an Oracle Applications
    Product or as a custom product, but NOTES_TOP is not defined.

    Current product is %.
    adrelink: warning: setting does not L % LIB
    as there is no $%%%_TOP/lib/%%%st.lib
    or cannot be read.
    adrelink: warning: setting does not L % STLIB
    as there is no $%%%_TOP/lib/%%%st.lib
    or cannot be read.

    Current product is AD
    LADLIB is set to e:/oracle/PROD/apps/apps_st/appl/ad/12.0.0/lib/adst.lib
    LADSTLIB is set to e:/oracle/PROD/apps/apps_st/appl/ad/12.0.0/lib/adst.lib

    Current product is ALR
    LALRLIB is set to e:/oracle/PROD/apps/apps_st/appl/alr/12.0.0/lib/alrst.lib
    LALRSTLIB is set to e:/oracle/PROD/apps/apps_st/appl/alr/12.0.0/lib/alrst.lib
    LALR115WLIB has the value
    e:/Oracle/prod/apps/apps_st/appl/ALR/12.0.0/lib/ALR115W.lib

    Current product is AP
    LAPLIB is set to e:/oracle/PROD/apps/apps_st/appl/ap/12.0.0/lib/AP.lib
    LAPSTLIB is set to e:/oracle/PROD/apps/apps_st/appl/ap/12.0.0/lib/apst.lib

    Current product is AR
    LARLIB is set to e:/oracle/PROD/apps/apps_st/appl/ar/12.0.0/lib/AR.lib
    LARSRW is set to e:/oracle/PROD/apps/apps_st/appl/ar/12.0.0/lib/xirar.obj
    $(LARLIB)
    LARSTLIB is set to e:/oracle/PROD/apps/apps_st/appl/ar/12.0.0/lib/arst.lib

    Current product is BOM
    LBOMLIB is set to e:/oracle/PROD/apps/apps_st/appl/bom/12.0.0/lib/BOM.lib
    LBOMSTLIB is set to e:/oracle/PROD/apps/apps_st/appl/bom/12.0.0/lib/bomst.lib

    Current product is CRP
    LCRPLIB is set to e:/oracle/PROD/apps/apps_st/appl/crp/12.0.0/lib/CRP.lib
    LCRPSTLIB is set to e:/oracle/PROD/apps/apps_st/appl/crp/12.0.0/lib/crpst.lib

    Current product is CZ
    LCZLIB is set to e:/oracle/PROD/apps/apps_st/appl/cz/12.0.0/lib/czst.lib
    LCZSTLIB is set to e:/oracle/PROD/apps/apps_st/appl/cz/12.0.0/lib/czst.lib

    Current product is DT
    LDTLIB is set to e:/oracle/PROD/apps/apps_st/appl/dt/12.0.0/lib/dtst.lib
    LDTSTLIB is set to e:/oracle/PROD/apps/apps_st/appl/dt/12.0.0/lib/dtst.lib
    LDT115WLIB has the value
    e:/Oracle/prod/apps/apps_st/appl/DT/12.0.0/lib/DT115W.lib

    adrelink: WARNING: product "END_OF_PRODUCT_ABBREVIATIONS" is listed as a
    Oracle Applications
    Product or as a custom product, but END_OF_PRODUCT_ABBREVIATIONS_TOP is not
    set.

    Current product is ENG
    LENGLIB is set to e:/oracle/PROD/apps/apps_st/appl/eng/12.0.0/lib/ENG.lib
    LENGSTLIB is set to e:/oracle/PROD/apps/apps_st/appl/eng/12.0.0/lib/engst.lib
    LENG115WLIB has the value
    e:/Oracle/prod/apps/apps_st/appl/Eng/12.0.0/lib/ENG115W.lib

    Current product is FA
    LFALIB is set to e:/oracle/PROD/apps/apps_st/appl/fa/12.0.0/lib/fast.lib
    LFASRW is set to e:/oracle/PROD/apps/apps_st/appl/fa/12.0.0/lib/xirfa.obj
    $(LFALIB)
    LFASTLIB is set to e:/oracle/PROD/apps/apps_st/appl/fa/12.0.0/lib/fast.lib
    LFA115WLIB has the value
    e:/Oracle/prod/apps/apps_st/appl/FA/12.0.0/lib/FA115W.lib

    Current product is MEF
    LFEMLIB is set to e:/oracle/PROD/apps/apps_st/appl/fem/12.0.0/lib/femst.lib
    LFEMSTLIB is set to e:/oracle/PROD/apps/apps_st/appl/fem/12.0.0/lib/femst.lib

    Current product is FF
    LFFLIB is set to e:/oracle/PROD/apps/apps_st/appl/ff/12.0.0/lib/FF.lib
    LFFSTLIB is set to e:/oracle/PROD/apps/apps_st/appl/ff/12.0.0/lib/ffst.lib
    LFF115WLIB has the value
    e:/Oracle/prod/apps/apps_st/appl/FF/12.0.0/lib/FF115W.lib

    Current product is FND
    LFNDLIB is set to e:/oracle/PROD/apps/apps_st/appl/fnd/12.0.0/lib/FNDCORE.lib
    LFNDSRW is set to e:/oracle/PROD/apps/apps_st/appl/fnd/12.0.0/lib/xirfnd.obj
    $(LFNDLIB)
    LFNDSTLIB is set to e:/oracle/PROD/apps/apps_st/appl/fnd/12.0.0/lib/fndst.lib
    LFND115WLIB has the value
    e:/Oracle/prod/apps/apps_st/appl/FND/12.0.0/lib/FND115W.lib
    LFNDCORELIB has the value
    e:/Oracle/prod/apps/apps_st/appl/FND/12.0.0/lib/FNDCORE.lib
    LFNDXITLIB has the value
    e:/Oracle/prod/apps/apps_st/appl/FND/12.0.0/lib/FNDXIT.lib
    LAPPR60UELIB has the value
    e:/Oracle/prod/apps/apps_st/appl/FND/12.0.0/lib/APPR60UE.lib

    Current product is FTP
    LFTPLIB is set to e:/oracle/PROD/apps/apps_st/appl/ftp/12.0.0/lib/ftpst.lib
    LFTPSTLIB is set to e:/oracle/PROD/apps/apps_st/appl/ftp/12.0.0/lib/ftpst.lib

    Current product is GL
    LGLLIB is set to e:/oracle/PROD/apps/apps_st/appl/gl/12.0.0/lib/GL.lib
    LGLSTLIB is set to e:/oracle/PROD/apps/apps_st/appl/gl/12.0.0/lib/glst.lib
    LGL115WLIB has the value
    e:/Oracle/prod/apps/apps_st/appl/GL/12.0.0/lib/GL115W.lib

    Current product is GMA
    LGMALIB is set to e:/oracle/PROD/apps/apps_st/appl/gma/12.0.0/lib/gmast.lib
    LGMASTLIB is set to e:/oracle/PROD/apps/apps_st/appl/gma/12.0.0/lib/gmast.lib
    LOPM115WLIB has the value
    e:/Oracle/prod/apps/apps_st/appl/GMA/12.0.0/lib/OPM115W.lib

    Current product is GMF
    LGMFLIB is set to e:/oracle/PROD/apps/apps_st/appl/gmf/12.0.0/lib/gmfst.lib
    LGMFSTLIB is set to e:/oracle/PROD/apps/apps_st/appl/gmf/12.0.0/lib/gmfst.lib

    Current product is GML
    LGMLLIB is set to e:/oracle/PROD/apps/apps_st/appl/gml/12.0.0/lib/gmlst.lib
    LGMLSTLIB is set to e:/oracle/PROD/apps/apps_st/appl/gml/12.0.0/lib/gmlst.lib

    Current product is IBY
    LIBYLIB is set to e:/oracle/PROD/apps/apps_st/appl/iby/12.0.0/lib/ibyst.lib
    LIBYSTLIB is set to e:/oracle/PROD/apps/apps_st/appl/iby/12.0.0/lib/ibyst.lib

    Current product is INV
    LINVLIB is set to e:/oracle/PROD/apps/apps_st/appl/inv/12.0.0/lib/INV.lib
    LINVSTLIB is set to e:/oracle/PROD/apps/apps_st/appl/inv/12.0.0/lib/invst.lib
    LINV115WLIB has the value
    e:/Oracle/prod/apps/apps_st/appl/Inv/12.0.0/lib/INV115W.lib

    Current product is IZU
    adrelink: warning: do not set LIZULIB
    as there is no e:/oracle/PROD/apps/apps_st/appl/izu/12.0.0/lib/izust.lib
    or cannot be read.
    adrelink: warning: do not set LIZUSTLIB
    as there is no e:/oracle/PROD/apps/apps_st/appl/izu/12.0.0/lib/izust.lib
    or cannot be read.

    Current product is MRP
    LMRPLIB is set to e:/oracle/PROD/apps/apps_st/appl/mrp/12.0.0/lib/MRP.lib
    LMRPSTLIB is set to e:/oracle/PROD/apps/apps_st/appl/mrp/12.0.0/lib/mrpst.lib

    Current product is MSC
    LMSCLIB is set to e:/oracle/PROD/apps/apps_st/appl/msc/12.0.0/lib/mscst.lib
    LMSCSTLIB is set to e:/oracle/PROD/apps/apps_st/appl/msc/12.0.0/lib/mscst.lib

    Current product is MSO
    LMSOLIB is set to e:/oracle/PROD/apps/apps_st/appl/mso/12.0.0/lib/msost.lib
    LMSOSTLIB is set to e:/oracle/PROD/apps/apps_st/appl/mso/12.0.0/lib/msost.lib

    Current product is MSR
    LMSRLIB is set to e:/oracle/PROD/apps/apps_st/appl/msr/12.0.0/lib/msrst.lib
    LMSRSTLIB is set to e:/oracle/PROD/apps/apps_st/appl/msr/12.0.0/lib/msrst.lib

    Current product of STD
    LMSTLIB is set to e:/oracle/PROD/apps/apps_st/appl/mst/12.0.0/lib/mstst.lib
    LMSTSTLIB is set to e:/oracle/PROD/apps/apps_st/appl/mst/12.0.0/lib/mstst.lib

    Current product is MWA
    LMWALIB is set to e:/oracle/PROD/apps/apps_st/appl/mwa/12.0.0/lib/mwast.lib
    LMWASTLIB is set to e:/oracle/PROD/apps/apps_st/appl/mwa/12.0.0/lib/mwast.lib

    Current product is PA
    LPALIB is set to e:/oracle/PROD/apps/apps_st/appl/pa/12.0.0/lib/past.lib
    LPASTLIB is set to e:/oracle/PROD/apps/apps_st/appl/pa/12.0.0/lib/past.lib

    Product current is PAID
    LPAYLIB is set to e:/oracle/PROD/apps/apps_st/appl/pay/12.0.0/lib/payst.lib
    LPAYSTLIB is set to e:/oracle/PROD/apps/apps_st/appl/pay/12.0.0/lib/payst.lib
    LPAY115WLIB has the value
    e:/Oracle/prod/apps/apps_st/appl/pay/12.0.0/lib/PAY115W.lib

    Current product is in.
    LPOLIB is set to e:/oracle/PROD/apps/apps_st/appl/po/12.0.0/lib/PO.lib
    LPOSRW is set to e:/oracle/PROD/apps/apps_st/appl/po/12.0.0/lib/xirpo.obj
    $(LPOLIB)
    LPOSTLIB is set to e:/oracle/PROD/apps/apps_st/appl/po/12.0.0/lib/post.lib
    LPO115WLIB has the value
    e:/Oracle/prod/apps/apps_st/appl/Po/12.0.0/lib/PO115W.lib

    Current product is PON
    LPONLIB is set to e:/oracle/PROD/apps/apps_st/appl/pon/12.0.0/lib/ponst.lib
    LPONSTLIB is set to e:/oracle/PROD/apps/apps_st/appl/pon/12.0.0/lib/ponst.lib

    Current product of RG
    LRGLIB is set to e:/oracle/PROD/apps/apps_st/appl/rg/12.0.0/lib/rgst.lib
    LRGSTLIB is set to e:/oracle/PROD/apps/apps_st/appl/rg/12.0.0/lib/rgst.lib

    Current product is WIP
    LWIPLIB is set to e:/oracle/PROD/apps/apps_st/appl/wip/12.0.0/lib/WIP.lib
    LWIPSTLIB is set to e:/oracle/PROD/apps/apps_st/appl/wip/12.0.0/lib/wipst.lib
    LWIP115WLIB has the value
    e:/Oracle/prod/apps/apps_st/appl/WIP/12.0.0/lib/WIP115W.lib

    Current product is WPS
    LWPSLIB is set to e:/oracle/PROD/apps/apps_st/appl/wps/12.0.0/lib/wpsst.lib
    LWPSSTLIB is set to e:/oracle/PROD/apps/apps_st/appl/wps/12.0.0/lib/wpsst.lib

    Current product is WSM
    LWSMLIB is set to e:/oracle/PROD/apps/apps_st/appl/wsm/12.0.0/lib/wsmst.lib
    LWSMSTLIB is set to e:/oracle/PROD/apps/apps_st/appl/wsm/12.0.0/lib/wsmst.lib

    Current product is XDP
    LXDPLIB is set to e:/oracle/PROD/apps/apps_st/appl/xdp/12.0.0/lib/xdpst.lib
    LXDPSTLIB is set to e:/oracle/PROD/apps/apps_st/appl/xdp/12.0.0/lib/xdpst.lib

    LUSRLIB is

    Not any product of mail Oracle Oracle Applications liaison

    LALRSTUB is about to
    e:/Oracle/prod/apps/apps_st/appl/ALR/12.0.0/lib/alstub.obj
    MAILLNK is about to
    e:/Oracle/prod/apps/apps_st/appl/ALR/12.0.0/lib/alstub.obj

    Creation of makefiles prefix...
    Fact creation prefix makefiles

    The e:/oracle/PROD/apps/apps_st/appl/admin/PROD/out/plkapp000.txt file
    contains:
    ***
    DNF e:\oracle\PROD\apps\apps_st\appl\fnd\12.0.0\bin\CONCSUB.exe
    bin CONCSUB.exe
    DNF e:\oracle\PROD\apps\apps_st\appl\fnd\12.0.0\bin\OAMKSVC.exe
    bin OAMKSVC.exe
    ***


    From the link of the product 'fnd' Wed Jan 13 17:22:14 SAST 2010
    Current product is fnd
    Product current is TOP $FNDTOP
    Current Prodarea is e:/oracle/PROD/apps/apps_st/appl/fnd/12.0.0


    Reissue of links module "CONCSUB.exe" in product DNF...

    gnumake f e:/oracle/PROD/apps/apps_st/appl/admin/PROD/out/link_fnd_2504.mk
    e:/Oracle/prod/Apps/apps_st/Appl/FND/12.0.0/bin/CONCSUB.exe

    From the executable fnd link 'CONCSUB.exe' the sea 13 Jan 17:22:16 SAST
    2010
    e:/Oracle/prod/apps/apps_st/appl/Admin/prod/out/link_fnd_2504.mk:751: *.
    target model does not contain any '% '. Stop.
    Done with the executable fnd link 'CONCSUB.exe' the sea Jan 13 17:22:16 SAST
    2010

    Relink the module 'CONCSUB.exe' failed.
    See error messages above (also recorded in the log file) possible
    reasons for the failure. In addition, please check that the Unix username
    running adrelink to read, write and execute permissions
    on the e:/oracle/PROD/apps/apps_st/appl/fnd/12.0.0/bin directory.
    and that there is enough space on the disk partition
    containing your Oracle Applications installation.

    Reissue of links module "OAMKSVC.exe" in product DNF...

    gnumake f e:/oracle/PROD/apps/apps_st/appl/admin/PROD/out/link_fnd_2504.mk
    e:/Oracle/prod/Apps/apps_st/Appl/FND/12.0.0/bin/OAMKSVC.exe

    From the executable fnd link 'OAMKSVC.exe' the sea 13 Jan 17:22:16 SAST
    2010
    e:/Oracle/prod/apps/apps_st/appl/Admin/prod/out/link_fnd_2504.mk:751: *.
    target model does not contain any '% '. Stop.
    Done with the executable fnd link 'OAMKSVC.exe' the sea Jan 13 17:22:16 SAST
    2010

    Relink the module 'OAMKSVC.exe' failed.
    See error messages above (also recorded in the log file) possible
    reasons for the failure. In addition, please check that the Unix username
    running adrelink to read, write and execute permissions
    on the e:/oracle/PROD/apps/apps_st/appl/fnd/12.0.0/bin directory.
    and that there is enough space on the disk partition
    containing your Oracle Applications installation.

    Done with the link of the product 'fnd' Wed Jan 13 17:22:16 SAST 2010


    adrelink dating status 1





    Help, please

    Kind regards

    Hassane Cabir

    Hi Mike;

    It might be good to start begging patch, just like you

    Your previous session to autopatch did not stand up to the end.
    You want to continue your previous session to AutoPatch Yes?

    Answer the call as No and keep it up. It will start the patch in the new session

    Respect of
    HELIOS

  • 1074395397 error occurred at InverseFFT IMAQ

    I have a problem in my VI. I can't get an image result after pressing the button for IFFT, even if I've initialized as complex an image. He said in error that it requires a complex picture. Thanks for help.

    I suggested in your other thread attempt to use the state machine.

    Coming to your problem here:

    -After pressing FFT, in the second iteration where FFT is false image that you spend?

  • Cannot create a vision assistant.error vi: labview and imaq missing

    I installed labview and vision assistant on my computer vista laptop-run

    Whan I try to create a vision assistant vi, it shows labview and imaq lack.

    Please try this

    Thanks in advance

    I reinstalled labview and other components. Now the problem is solved

    Thanks for help

  • General error on the display of CV - model # E910A wireless printer

    When printing, after 2 pages have been printed, I get a general error as follows:

    "There is a problem with the printer

    See the 0x610000f6 printer documentation. "

    I was wondering if anyone has had this problem & what to do to get rid of the message?

    Please notify

    Thank you

    Hi Hockey1,

    Welcome to the HP Forums.

    I see that you have a problem with the error code "0x610000f6".

    First of all, please make sure that you have the printer power cable connected directly to a wall outlet and not a bar/power strip. Here is a document that uses a LaserJet printer for example, but it is intended for HP products in general. Please click the link which explains the problems when connected to an uninterruptible power supply/Strip/surge protector power.

    "I have also found a document that addresses 'traffic Jam' or ' 0X610000F6" message for HP Officejet 7500 (E910a and E910c) a large Format e-all-in-one printers.

    If troubleshooting doesn't help not solve your problem, then I would say call the HP Technical Support to see all the other possibilities for you. If you call in North America, the number is 1-800-474-6836 and for all other regions, please click here: click here.

    Thanks for your time.

    See you soon,.

  • The deployment of SummitADF to 12.1.2 IntegratedWebLogicServer error: java.lang.ClassNotFoundException: oracle.adf.model.servlet.ADFBindingFilter

    Hello!

    I try to deploy the deployment SummitADF_application1 SummitADF for the IntegratedWebLogicServer demand profile I 12.1.2 JDeveloper on Windows 7 home 64 bit.

    Anyone done this successfully before or can test this?

    This is the stack of error in the console:

    [20: 52:02]-deployment began.  ----

    [20: 52:02] the target platform's (Weblogic 12.x).

    [20: 52:02] recovery of the existing application information

    [20: 52:02] analysis of the dependence running...

    [20: 52:02] building...

    [20: 52:03] deployment 2 profiles...

    [20: 52:04] wrote on the Web for C:\shared\summit\SummitADF_Core1212\ViewController\deploy\SummitADF_ViewController_webapp1.war application Module

    [20: 52:05] wrote the Module Enterprise Application to C:\shared\summit\SummitADF_Core1212\deploy\SummitADF_application1.ear

    [20: 52:05] Application deployment...

    [20: 52:10] [Deployer: 149193] Operation "deploy" on demand "SummitADF_application1" failed on "DefaultServer".

    [20: 52:10] [Deployer: 149034] an exception has occurred for task [Deployer: 149026] deploy SummitADF_application1 on DefaultServer. : java.lang.ClassNotFoundException: oracle.adf.library.webapp.ResourceServlet.

    [20: 52:10] weblogic.application.ModuleException: java.lang.ClassNotFoundException: oracle.adf.library.webapp.ResourceServlet

    [20: 52:10] undeployment.

    [20: 52:10] - incomplete deployment.

    [20: 52:10] remote deployment failed (oracle.jdevimpl.deploy.common.Jsr88RemoteDeployer)

    Kind regards

    Torsten Kleiber

    It seems that delivered deployment profiles are default. I created my own deployment profile which works very well.

  • "An insufficient number of calibration points function" in the calibration to learn?

    I suspect that IMAQ learning model calibration VI can be tapped, like I can't make it work for the few reference points.

    I get error-1074396116, even when I'm passing over 4 points of reference, as specified using.

    I noticed these posts, the http://forums.ni.com/ni/board/message?board.id=200&requireLogin=False&thread.id=10257, the http://forums.ni.com/ni/board/message?board.id=200&message.id=17400&requireLogin=False, where the problem seems solved. The VI of the sample provided by the first poster, http://forums.ni.com/ni/attachments/ni/200/10279/1/Reference_Points1.vi, does not work for me either.

    My setup is LV9 on winXp32, image of 640 x 480 8-bit grayscale. What I try to do is not the subject of the post, the potential bug is.

    Can anyone provide a working example? Calibration samples included in the finder of the example use calibration grids, not of few reference points AFAIU.

    Thanks in advance, Enrico

    After a little experimentation with the VI provided by the first poster (attached my small change), I realize account of the calibration point of view seem to need a minimum of 5 points, while non-linear required a minimum of 9. So, there is a bug in the documentation. This can be confirmed?

    Thank you, Enrico

Maybe you are looking for

  • iPhone IOS 9.3.1 6s: remove the my music

    Hi guys My iPhone 6 s deleted my music. I see all the songs in iTunes under purchased, but I need to re - download it again. This happens usually after 2-3 months and its very frustrating when I have to keep re - download the same songs and its costi

  • I want to unlock certain emails that is blocking Firefox.

    Some of my e-mails from a known source are blocked by Firefox and there is no way for me to indicate that I want emails from these addresses should be allowed. This is a recent problem

  • Swipe-able notes app for iPad 2

    I would like to find an application of notes on my ipad2 "shot-capable". I work as a musician and need to take notes for each song performance so that I can drag one title to another without the need to return to a list. Every night the list changes

  • Satellite C70-C-199 - dual channel mode is not active for RAM modules

    Hello I recently bought a Satellite C70-C-199 laptop with 4 GB RAM and I installed a module of RAM 4 GB more.The module I installed is not recognized by the BIOS. What I tried:(1) replace the Rams repeatedly.(2) exchanging the two Rams between the tw

  • (CPU Upgrade Possible?) DV7-6168nr

    I wanted to know if it was possible to update this APU in this laptop DV7-6168nr. There is no guarantee on this laptop, I'm not concerned about it. I wanted to spend to possibly an A8 APU? Stock that laptop has an AMD A6 - 3400M Taken FS1 (905) Clock


HashFlare